BDBM68251 Microlactone, 16b
SMILES: CC1C[C@H]2O[C@@H]2CCCCC(=O)Cc2c(Cl)c(O)cc(O)c2C(=O)O1
InChI Key: InChIKey=ZGZOBNGYHLFQFW-ANWCPOMBSA-N
Data: 3 IC50
Activity Spreadsheet -- Enzyme Inhibition Constant Data from BindingDB
Found 3 hits for monomerid = 68251
Trg + Lig
Ki
nM
ΔG°
kcal/mole
IC50
nM
Kd
nM
EC50/IC50
nM
koff
s-1
kon
M-1s-1
pHTemp
°C
Heat Shock Protein 90 (Hsp90)
(Saccharomyces cerevisiae)
BDBM68251
(Microlactone, 16b)
Show SMILES CC1C[C@H]2O[C@@H]2CCCCC(=O)Cc2c(Cl)c(O)cc(O)c2C(=O)O1 |r,w:1.0|
Show InChI InChI=1S/C18H21ClO6/c1-9-6-15-14(25-15)5-3-2-4-10(20)7-11-16(18(23)24-9)12(21)8-13(22)17(11)19/h8-9,14-15,21-22H,2-7H2,1H3/t9?,14-,15-/m1/s1
Reactome pathway
n/an/a 1.90E+3n/an/an/an/an/an/a
University of Nottingham
Assay Description
A colorimetric assay for the release of inorganic phosphate upon hydrolysis of ATP was used to determine the potency of Hsp 90 inhibitor against enzy...
Chem Biol 13: 1203-15 (2006)
Article DOI: 10.1016/j.chembiol.2006.09.015
BindingDB Entry DOI: 10.7270/Q2930RMM
Heat Shock Protein 90 (Hsp90)
(Saccharomyces cerevisiae)
BDBM68251
(Microlactone, 16b)
Show SMILES CC1C[C@H]2O[C@@H]2CCCCC(=O)Cc2c(Cl)c(O)cc(O)c2C(=O)O1 |r,w:1.0|
Show InChI InChI=1S/C18H21ClO6/c1-9-6-15-14(25-15)5-3-2-4-10(20)7-11-16(18(23)24-9)12(21)8-13(22)17(11)19/h8-9,14-15,21-22H,2-7H2,1H3/t9?,14-,15-/m1/s1
Reactome pathway
n/an/a 250n/an/an/an/an/an/a
University of Nottingham
Assay Description
Binding competition assay with a fluorescent probe.
Chem Biol 13: 1203-15 (2006)
Article DOI: 10.1016/j.chembiol.2006.09.015
BindingDB Entry DOI: 10.7270/Q2930RMM
Heat Shock Protein 90 (Hsp90)
(Saccharomyces cerevisiae)
BDBM68251
(Microlactone, 16b)
Show SMILES CC1C[C@H]2O[C@@H]2CCCCC(=O)Cc2c(Cl)c(O)cc(O)c2C(=O)O1 |r,w:1.0|
Show InChI InChI=1S/C18H21ClO6/c1-9-6-15-14(25-15)5-3-2-4-10(20)7-11-16(18(23)24-9)12(21)8-13(22)17(11)19/h8-9,14-15,21-22H,2-7H2,1H3/t9?,14-,15-/m1/s1
Reactome pathway
n/an/a 310n/an/an/an/an/an/a
University of Nottingham
Assay Description
Binding competition assay with a fluorescent probe.
Chem Biol 13: 1203-15 (2006)
Article DOI: 10.1016/j.chembiol.2006.09.015
BindingDB Entry DOI: 10.7270/Q2930RMM