BDBM6837 indolocarbazole deriv. 13a::methyl 1-(2-{18-methyl-12,14-dioxo-3,13,18-triazahexacyclo[14.7.0.0^{2,10}.0^{4,9}.0^{11,15}.0^{17,21}]tricosa-1(16),2(10),4(9),5,7,11(15),17(21),19,22-nonaen-5-yl}ethyl)piperidine-4-carboxylate
SMILES: COC(=O)C1CCN(CCc2cccc3c2[nH]c2c3c3C(=O)NC(=O)c3c3c4n(C)ccc4ccc23)CC1
InChI Key: InChIKey=XOFQJBDORDALAH-UHFFFAOYSA-N
Data: 6 IC50
Activity Spreadsheet -- Enzyme Inhibition Constant Data from BindingDB
Found 6 hits for monomerid = 6837
Trg + Lig
Ki
nM
ΔG°
kcal/mole
IC50
nM
Kd
nM
EC50/IC50
nM
koff
s-1
kon
M-1s-1
pHTemp
°C
Cyclin-Dependent Kinase 4 (CDK4)
(Homo sapiens (Human))
BDBM6837
(indolocarbazole deriv. 13a | methyl 1-(2-{18-methy...)
Show SMILES COC(=O)C1CCN(CCc2cccc3c2[nH]c2c3c3C(=O)NC(=O)c3c3c4n(C)ccc4ccc23)CC1
Show InChI InChI=1S/C30H28N4O4/c1-33-12-8-17-6-7-20-22(27(17)33)24-23(28(35)32-29(24)36)21-19-5-3-4-16(25(19)31-26(20)21)9-13-34-14-10-18(11-15-34)30(37)38-2/h3-8,12,18,31H,9-11,13-15H2,1-2H3,(H,32,35,36)
NCI pathway
Reactome pathway
n/an/a 47n/an/an/an/an/a25
Lilly Research Laboratories
Assay Description
In vitro CDK assay using purified enzyme, was incubated at room temperature with substrate, and test compounds in the presence of ATP/[gamma-33P]ATP....
Bioorg Med Chem Lett 13: 2261-7 (2003)
Article DOI: 10.1016/s0960-894x(03)00461-x
BindingDB Entry DOI: 10.7270/Q29W0CPW
Cyclin-Dependent Kinase 4 (CDK4)
(Homo sapiens (Human))
BDBM6837
(indolocarbazole deriv. 13a | methyl 1-(2-{18-methy...)
Show SMILES COC(=O)C1CCN(CCc2cccc3c2[nH]c2c3c3C(=O)NC(=O)c3c3c4n(C)ccc4ccc23)CC1
Show InChI InChI=1S/C30H28N4O4/c1-33-12-8-17-6-7-20-22(27(17)33)24-23(28(35)32-29(24)36)21-19-5-3-4-16(25(19)31-26(20)21)9-13-34-14-10-18(11-15-34)30(37)38-2/h3-8,12,18,31H,9-11,13-15H2,1-2H3,(H,32,35,36)
NCI pathway
Reactome pathway
n/an/a 13n/an/an/an/an/a25
Lilly Research Laboratories
Assay Description
In vitro CDK assay using purified enzyme, was incubated at room temperature with substrate, and test compounds in the presence of ATP/[gamma-33P]ATP....
Bioorg Med Chem Lett 13: 2261-7 (2003)
Article DOI: 10.1016/s0960-894x(03)00461-x
BindingDB Entry DOI: 10.7270/Q29W0CPW
CDK2/CycE
(Homo sapiens (Human))
BDBM6837
(indolocarbazole deriv. 13a | methyl 1-(2-{18-methy...)
Show SMILES COC(=O)C1CCN(CCc2cccc3c2[nH]c2c3c3C(=O)NC(=O)c3c3c4n(C)ccc4ccc23)CC1
Show InChI InChI=1S/C30H28N4O4/c1-33-12-8-17-6-7-20-22(27(17)33)24-23(28(35)32-29(24)36)21-19-5-3-4-16(25(19)31-26(20)21)9-13-34-14-10-18(11-15-34)30(37)38-2/h3-8,12,18,31H,9-11,13-15H2,1-2H3,(H,32,35,36)
n/an/a 977n/an/an/an/an/an/a
University of Tours
Curated by ChEMBL
Assay Description
Inhibition of CDK2/Cyclin E (unknown origin)
Eur J Med Chem 108: 701-19 (2016)
BindingDB Entry DOI: 10.7270/Q22J6DQD
cAMP-Dependent Protein Kinase (PKA)
(Bos taurus (bovine))
BDBM6837
(indolocarbazole deriv. 13a | methyl 1-(2-{18-methy...)
Show SMILES COC(=O)C1CCN(CCc2cccc3c2[nH]c2c3c3C(=O)NC(=O)c3c3c4n(C)ccc4ccc23)CC1
Show InChI InChI=1S/C30H28N4O4/c1-33-12-8-17-6-7-20-22(27(17)33)24-23(28(35)32-29(24)36)21-19-5-3-4-16(25(19)31-26(20)21)9-13-34-14-10-18(11-15-34)30(37)38-2/h3-8,12,18,31H,9-11,13-15H2,1-2H3,(H,32,35,36)
n/an/a>2.00E+4n/an/an/an/an/a25
Lilly Research Laboratories
Assay Description
In vitro kinase assay using purified enzyme, was incubated at room temperature with substrate, and test compounds in the presence of ATP/[gamma-33P]A...
Bioorg Med Chem Lett 13: 2261-7 (2003)
Article DOI: 10.1016/s0960-894x(03)00461-x
BindingDB Entry DOI: 10.7270/Q29W0CPW
CaM Kinase II
(Rattus norvegicus (rat))
BDBM6837
(indolocarbazole deriv. 13a | methyl 1-(2-{18-methy...)
Show SMILES COC(=O)C1CCN(CCc2cccc3c2[nH]c2c3c3C(=O)NC(=O)c3c3c4n(C)ccc4ccc23)CC1
Show InChI InChI=1S/C30H28N4O4/c1-33-12-8-17-6-7-20-22(27(17)33)24-23(28(35)32-29(24)36)21-19-5-3-4-16(25(19)31-26(20)21)9-13-34-14-10-18(11-15-34)30(37)38-2/h3-8,12,18,31H,9-11,13-15H2,1-2H3,(H,32,35,36)
n/an/a 81n/an/an/an/an/a25
Lilly Research Laboratories
Assay Description
In vitro kinase assay using purified enzyme, was incubated at room temperature with substrate, and test compounds in the presence of ATP/[gamma-33P]A...
Bioorg Med Chem Lett 13: 2261-7 (2003)
Article DOI: 10.1016/s0960-894x(03)00461-x
BindingDB Entry DOI: 10.7270/Q29W0CPW
CDK2/CycE
(Homo sapiens (Human))
BDBM6837
(indolocarbazole deriv. 13a | methyl 1-(2-{18-methy...)
Show SMILES COC(=O)C1CCN(CCc2cccc3c2[nH]c2c3c3C(=O)NC(=O)c3c3c4n(C)ccc4ccc23)CC1
Show InChI InChI=1S/C30H28N4O4/c1-33-12-8-17-6-7-20-22(27(17)33)24-23(28(35)32-29(24)36)21-19-5-3-4-16(25(19)31-26(20)21)9-13-34-14-10-18(11-15-34)30(37)38-2/h3-8,12,18,31H,9-11,13-15H2,1-2H3,(H,32,35,36)
n/an/a 972n/an/an/an/an/a25
Lilly Research Laboratories
Assay Description
In vitro CDK assay using purified enzyme, was incubated at room temperature with substrate, and test compounds in the presence of ATP/[gamma-33P]ATP....
Bioorg Med Chem Lett 13: 2261-7 (2003)
Article DOI: 10.1016/s0960-894x(03)00461-x
BindingDB Entry DOI: 10.7270/Q29W0CPW