BDBM6848 5-{3-[(2-hydroxyethyl)amino]propyl}-18-methyl-3,13,18-triazahexacyclo[14.7.0.0^{2,10}.0^{4,9}.0^{11,15}.0^{17,21}]tricosa-1(16),2(10),4(9),5,7,11(15),17(21),19,22-nonaene-12,14-dione::indolocarbazole deriv. 14h
SMILES: Cn1ccc2ccc3c4[nH]c5c(CCCNCCO)cccc5c4c4C(=O)NC(=O)c4c3c12
InChI Key: InChIKey=ZHBAGBACXDDSPH-UHFFFAOYSA-N
Data: 5 IC50
Activity Spreadsheet -- Enzyme Inhibition Constant Data from BindingDB
Found 5 hits for monomerid = 6848
Trg + Lig
Ki
nM
ΔG°
kcal/mole
IC50
nM
Kd
nM
EC50/IC50
nM
koff
s-1
kon
M-1s-1
pHTemp
°C
Cyclin-Dependent Kinase 4 (CDK4)
(Homo sapiens (Human))
BDBM6848
(5-{3-[(2-hydroxyethyl)amino]propyl}-18-methyl-3,13...)
Show SMILES Cn1ccc2ccc3c4[nH]c5c(CCCNCCO)cccc5c4c4C(=O)NC(=O)c4c3c12
Show InChI InChI=1S/C26H24N4O3/c1-30-12-9-15-7-8-17-19(24(15)30)21-20(25(32)29-26(21)33)18-16-6-2-4-14(22(16)28-23(17)18)5-3-10-27-11-13-31/h2,4,6-9,12,27-28,31H,3,5,10-11,13H2,1H3,(H,29,32,33)
NCI pathway
Reactome pathway
n/an/a 40n/an/an/an/an/a25
Lilly Research Laboratories
Assay Description
In vitro CDK assay using purified enzyme, was incubated at room temperature with substrate, and test compounds in the presence of ATP/[gamma-33P]ATP....
Bioorg Med Chem Lett 13: 2261-7 (2003)
Article DOI: 10.1016/s0960-894x(03)00461-x
BindingDB Entry DOI: 10.7270/Q29W0CPW
Cyclin-Dependent Kinase 4 (CDK4)
(Homo sapiens (Human))
BDBM6848
(5-{3-[(2-hydroxyethyl)amino]propyl}-18-methyl-3,13...)
Show SMILES Cn1ccc2ccc3c4[nH]c5c(CCCNCCO)cccc5c4c4C(=O)NC(=O)c4c3c12
Show InChI InChI=1S/C26H24N4O3/c1-30-12-9-15-7-8-17-19(24(15)30)21-20(25(32)29-26(21)33)18-16-6-2-4-14(22(16)28-23(17)18)5-3-10-27-11-13-31/h2,4,6-9,12,27-28,31H,3,5,10-11,13H2,1H3,(H,29,32,33)
NCI pathway
Reactome pathway
n/an/a 19n/an/an/an/an/a25
Lilly Research Laboratories
Assay Description
In vitro CDK assay using purified enzyme, was incubated at room temperature with substrate, and test compounds in the presence of ATP/[gamma-33P]ATP....
Bioorg Med Chem Lett 13: 2261-7 (2003)
Article DOI: 10.1016/s0960-894x(03)00461-x
BindingDB Entry DOI: 10.7270/Q29W0CPW
CaM Kinase II
(Rattus norvegicus (rat))
BDBM6848
(5-{3-[(2-hydroxyethyl)amino]propyl}-18-methyl-3,13...)
Show SMILES Cn1ccc2ccc3c4[nH]c5c(CCCNCCO)cccc5c4c4C(=O)NC(=O)c4c3c12
Show InChI InChI=1S/C26H24N4O3/c1-30-12-9-15-7-8-17-19(24(15)30)21-20(25(32)29-26(21)33)18-16-6-2-4-14(22(16)28-23(17)18)5-3-10-27-11-13-31/h2,4,6-9,12,27-28,31H,3,5,10-11,13H2,1H3,(H,29,32,33)
n/an/a 266n/an/an/an/an/a25
Lilly Research Laboratories
Assay Description
In vitro kinase assay using purified enzyme, was incubated at room temperature with substrate, and test compounds in the presence of ATP/[gamma-33P]A...
Bioorg Med Chem Lett 13: 2261-7 (2003)
Article DOI: 10.1016/s0960-894x(03)00461-x
BindingDB Entry DOI: 10.7270/Q29W0CPW
cAMP-Dependent Protein Kinase (PKA)
(Bos taurus (bovine))
BDBM6848
(5-{3-[(2-hydroxyethyl)amino]propyl}-18-methyl-3,13...)
Show SMILES Cn1ccc2ccc3c4[nH]c5c(CCCNCCO)cccc5c4c4C(=O)NC(=O)c4c3c12
Show InChI InChI=1S/C26H24N4O3/c1-30-12-9-15-7-8-17-19(24(15)30)21-20(25(32)29-26(21)33)18-16-6-2-4-14(22(16)28-23(17)18)5-3-10-27-11-13-31/h2,4,6-9,12,27-28,31H,3,5,10-11,13H2,1H3,(H,29,32,33)
n/an/a 8.31E+3n/an/an/an/an/a25
Lilly Research Laboratories
Assay Description
In vitro kinase assay using purified enzyme, was incubated at room temperature with substrate, and test compounds in the presence of ATP/[gamma-33P]A...
Bioorg Med Chem Lett 13: 2261-7 (2003)
Article DOI: 10.1016/s0960-894x(03)00461-x
BindingDB Entry DOI: 10.7270/Q29W0CPW
CDK2/CycE
(Homo sapiens (Human))
BDBM6848
(5-{3-[(2-hydroxyethyl)amino]propyl}-18-methyl-3,13...)
Show SMILES Cn1ccc2ccc3c4[nH]c5c(CCCNCCO)cccc5c4c4C(=O)NC(=O)c4c3c12
Show InChI InChI=1S/C26H24N4O3/c1-30-12-9-15-7-8-17-19(24(15)30)21-20(25(32)29-26(21)33)18-16-6-2-4-14(22(16)28-23(17)18)5-3-10-27-11-13-31/h2,4,6-9,12,27-28,31H,3,5,10-11,13H2,1H3,(H,29,32,33)
n/an/a 567n/an/an/an/an/a25
Lilly Research Laboratories
Assay Description
In vitro CDK assay using purified enzyme, was incubated at room temperature with substrate, and test compounds in the presence of ATP/[gamma-33P]ATP....
Bioorg Med Chem Lett 13: 2261-7 (2003)
Article DOI: 10.1016/s0960-894x(03)00461-x
BindingDB Entry DOI: 10.7270/Q29W0CPW