BDBM6858 8-bromo-3,13,23-triazahexacyclo[14.7.0.0^{2,10}.0^{4,9}.0^{11,15}.0^{17,22}]tricosa-1(16),2(10),4(9),5,7,11(15),17(22),18,20-nonaene-12,14-dione::Indolocarbazole deriv. 4(b)
SMILES: Brc1cccc2[nH]c3c4[nH]c5ccccc5c4c4C(=O)NC(=O)c4c3c12
InChI Key: InChIKey=LAMWYYXJYIQOQL-UHFFFAOYSA-N
Data: 5 IC50
Activity Spreadsheet -- Enzyme Inhibition Constant Data from BindingDB
Found 5 hits for monomerid = 6858
Trg + Lig
Ki
nM
ΔG°
kcal/mole
IC50
nM
Kd
nM
EC50/IC50
nM
koff
s-1
kon
M-1s-1
pHTemp
°C
Cyclin-Dependent Kinase 4 (CDK4)
(Homo sapiens (Human))
BDBM6858
(8-bromo-3,13,23-triazahexacyclo[14.7.0.0^{2,10}.0^...)
Show SMILES Brc1cccc2[nH]c3c4[nH]c5ccccc5c4c4C(=O)NC(=O)c4c3c12
Show InChI InChI=1S/C20H10BrN3O2/c21-9-5-3-7-11-13(9)14-16-15(19(25)24-20(16)26)12-8-4-1-2-6-10(8)22-17(12)18(14)23-11/h1-7,22-23H,(H,24,25,26)
NCI pathway
Reactome pathway
n/an/a 80n/an/an/an/a7.022
Lilly Research Laboratories
Assay Description
In vitro kinase assay using purified enzyme, was incubated at room temperature with substrate, and test compounds in the presence of ATP/[gamma-33P]A...
J Med Chem 46: 2027-30 (2003)
Article DOI: 10.1021/jm0256169
BindingDB Entry DOI: 10.7270/Q2668BCN
CDK2/CycE
(Homo sapiens (Human))
BDBM6858
(8-bromo-3,13,23-triazahexacyclo[14.7.0.0^{2,10}.0^...)
Show SMILES Brc1cccc2[nH]c3c4[nH]c5ccccc5c4c4C(=O)NC(=O)c4c3c12
Show InChI InChI=1S/C20H10BrN3O2/c21-9-5-3-7-11-13(9)14-16-15(19(25)24-20(16)26)12-8-4-1-2-6-10(8)22-17(12)18(14)23-11/h1-7,22-23H,(H,24,25,26)
n/an/a 220n/an/an/an/a7.022
Lilly Research Laboratories
Assay Description
In vitro kinase assay using purified enzyme, was incubated at room temperature with substrate, and test compounds in the presence of ATP/[gamma-33P]A...
J Med Chem 46: 2027-30 (2003)
Article DOI: 10.1021/jm0256169
BindingDB Entry DOI: 10.7270/Q2668BCN
cAMP-Dependent Protein Kinase (PKA)
(Bos taurus (bovine))
BDBM6858
(8-bromo-3,13,23-triazahexacyclo[14.7.0.0^{2,10}.0^...)
Show SMILES Brc1cccc2[nH]c3c4[nH]c5ccccc5c4c4C(=O)NC(=O)c4c3c12
Show InChI InChI=1S/C20H10BrN3O2/c21-9-5-3-7-11-13(9)14-16-15(19(25)24-20(16)26)12-8-4-1-2-6-10(8)22-17(12)18(14)23-11/h1-7,22-23H,(H,24,25,26)
n/an/a 103n/an/an/an/an/a25
Lilly Research Laboratories
Assay Description
In vitro kinase assay using purified enzyme, was incubated at room temperature with substrate, and test compounds in the presence of ATP/[gamma-33P]A...
J Med Chem 46: 2027-30 (2003)
Article DOI: 10.1021/jm0256169
BindingDB Entry DOI: 10.7270/Q2668BCN
Cyclin-Dependent Kinase 1 (CDK1)
(Homo sapiens (Human))
BDBM6858
(8-bromo-3,13,23-triazahexacyclo[14.7.0.0^{2,10}.0^...)
Show SMILES Brc1cccc2[nH]c3c4[nH]c5ccccc5c4c4C(=O)NC(=O)c4c3c12
Show InChI InChI=1S/C20H10BrN3O2/c21-9-5-3-7-11-13(9)14-16-15(19(25)24-20(16)26)12-8-4-1-2-6-10(8)22-17(12)18(14)23-11/h1-7,22-23H,(H,24,25,26)
Reactome pathway
n/an/a 300n/an/an/an/an/a25
Lilly Research Laboratories
Assay Description
In vitro kinase assay using purified enzyme, was incubated at room temperature with substrate, and test compounds in the presence of ATP/[gamma-33P]A...
J Med Chem 46: 2027-30 (2003)
Article DOI: 10.1021/jm0256169
BindingDB Entry DOI: 10.7270/Q2668BCN
CaM Kinase II
(Rattus norvegicus (rat))
BDBM6858
(8-bromo-3,13,23-triazahexacyclo[14.7.0.0^{2,10}.0^...)
Show SMILES Brc1cccc2[nH]c3c4[nH]c5ccccc5c4c4C(=O)NC(=O)c4c3c12
Show InChI InChI=1S/C20H10BrN3O2/c21-9-5-3-7-11-13(9)14-16-15(19(25)24-20(16)26)12-8-4-1-2-6-10(8)22-17(12)18(14)23-11/h1-7,22-23H,(H,24,25,26)
n/an/a 58n/an/an/an/an/a25
Lilly Research Laboratories
Assay Description
In vitro kinase assay using purified enzyme, was incubated at room temperature with substrate, and test compounds in the presence of ATP/[gamma-33P]A...
J Med Chem 46: 2027-30 (2003)
Article DOI: 10.1021/jm0256169
BindingDB Entry DOI: 10.7270/Q2668BCN