BDBM68846 2-(2-carboxyanilino)benzoic acid::2-[(2-carboxyphenyl)amino]benzoic acid::MLS000521358::SMR000131766::cid_11371
SMILES: OC(=O)c1ccccc1Nc1ccccc1C(O)=O
InChI Key: InChIKey=ZFRNOTZQUGWMQN-UHFFFAOYSA-N
Data: 1 EC50
PDB links: 2 PDB IDs match this monomer.
Activity Spreadsheet -- Enzyme Inhibition Constant Data from BindingDB
Found 1 hit for monomerid = 68846
Trg + Lig
Ki
nM
ΔG°
kcal/mole
IC50
nM
Kd
nM
EC50/IC50
nM
koff
s-1
kon
M-1s-1
pHTemp
°C
Glycogen synthase kinase-3 beta
(Homo sapiens (Human))
BDBM68846
(2-(2-carboxyanilino)benzoic acid | 2-[(2-carboxyph...)
Show SMILES OC(=O)c1ccccc1Nc1ccccc1C(O)=O
Show InChI InChI=1S/C14H11NO4/c16-13(17)9-5-1-3-7-11(9)15-12-8-4-2-6-10(12)14(18)19/h1-8,15H,(H,16,17)(H,18,19)
NCI pathway
Reactome pathway
PCBioAssay
n/an/an/an/a>3.00E+5n/an/an/an/a
Broad Institute
Curated by PubChem BioAssay
Assay Description
Keywords: GSK3beta, dose response, kinase, inhibition, HTS Assay Overview: The glycogen synthase kinase-3 beta (GSK-3b) is a known master regulator f...
PubChem Bioassay (2010)
BindingDB Entry DOI: 10.7270/Q2TX3CTT