BDBM700 (2R,3R,4R,5R)-3,4-dihydroxy-N,N'-bis[(1S,2R)-2-hydroxy-2,3-dihydro-1H-inden-1-yl]-2,5-bis(thiophen-2-ylsulfanyl)hexanediamide::Diol-Based HIV-1 protease inhibitor 13::N1,N6-Di[(2R)-hydroxy-(1S)-indanyl]-(2R,3R,4R,5R)-3,4-dihydroxy-2,5-di(thiophen-3-ylsulfanyl)hexanediamide
SMILES: O[C@H]([C@@H](O)[C@@H](Sc1cccs1)C(=O)N[C@@H]1[C@H](O)Cc2ccccc12)[C@@H](Sc1cccs1)C(=O)N[C@@H]1[C@H](O)Cc2ccccc12
InChI Key: InChIKey=FTARTHFTPFFKDG-NTZBCTBQSA-N
Data: 1 KI
Activity Spreadsheet -- Enzyme Inhibition Constant Data from BindingDB
Found 1 hit for monomerid = 700
Trg + Lig
Ki
nM
ΔG°
kcal/mole
IC50
nM
Kd
nM
EC50/IC50
nM
koff
s-1
kon
M-1s-1
pHTemp
°C
HIV-1 Protease
(Human immunodeficiency virus type 1)
BDBM700
((2R,3R,4R,5R)-3,4-dihydroxy-N,N'-bis[(1S,2R)-2-hyd...)
Show SMILES O[C@H]([C@@H](O)[C@@H](Sc1cccs1)C(=O)N[C@@H]1[C@H](O)Cc2ccccc12)[C@@H](Sc1cccs1)C(=O)N[C@@H]1[C@H](O)Cc2ccccc12 |r|
Show InChI InChI=1S/C32H32N2O6S4/c35-21-15-17-7-1-3-9-19(17)25(21)33-31(39)29(43-23-11-5-13-41-23)27(37)28(38)30(44-24-12-6-14-42-24)32(40)34-26-20-10-4-2-8-18(20)16-22(26)36/h1-14,21-22,25-30,35-38H,15-16H2,(H,33,39)(H,34,40)/t21-,22-,25+,26+,27-,28-,29-,30-/m1/s1
0.5 -12.9n/an/an/an/an/a5.030
Stockholm University
Assay Description
A fluorimetric assay was used to determine the effects of the inhibitors on HIV-1 protease. This assay used an internally quenched fluorescent peptid...
J Med Chem 44: 3402-6 (2001)
Article DOI: 10.1021/jm0011169
BindingDB Entry DOI: 10.7270/Q2R78CCC