BDBM7013 (4R,5S,6S,7R)-1,3-dibenzyl-5,6-dihydroxy-4,7-bis(naphthalen-2-ylmethyl)-1,3-diazepan-2-one::Cyclic Urea Based HIV-1 Protease Inhibitor 19
SMILES: O[C@@H]1[C@@H](O)[C@@H](Cc2ccc3ccccc3c2)N(Cc2ccccc2)C(=O)N(Cc2ccccc2)[C@@H]1Cc1ccc2ccccc2c1
InChI Key: InChIKey=AUTHLCQFZJFGMT-WESAGZJESA-N
Data: 1 KI
PDB links: 8 PDB IDs contain inhibitors having a similarity of 90% to this monomer.
Activity Spreadsheet -- Enzyme Inhibition Constant Data from BindingDB
Found 1 hit for monomerid = 7013
Trg + Lig
Ki
nM
ΔG°
kcal/mole
IC50
nM
Kd
nM
EC50/IC50
nM
koff
s-1
kon
M-1s-1
pHTemp
°C
HIV-1 Protease
(Human immunodeficiency virus type 1)
BDBM7013
((4R,5S,6S,7R)-1,3-dibenzyl-5,6-dihydroxy-4,7-bis(n...)
Show SMILES O[C@@H]1[C@@H](O)[C@@H](Cc2ccc3ccccc3c2)N(Cc2ccccc2)C(=O)N(Cc2ccccc2)[C@@H]1Cc1ccc2ccccc2c1
Show InChI InChI=1S/C41H38N2O3/c44-39-37(25-31-19-21-33-15-7-9-17-35(33)23-31)42(27-29-11-3-1-4-12-29)41(46)43(28-30-13-5-2-6-14-30)38(40(39)45)26-32-20-22-34-16-8-10-18-36(34)24-32/h1-24,37-40,44-45H,25-28H2/t37-,38-,39+,40+/m1/s1
9.80 -11.4n/an/an/an/an/a5.537
DuPont Merck Pharmaceutical Company
Assay Description
Inhibition of HIV protease was measured by assay of the cleavage of a fluorescent peptide substrate. The fluorescent product (2-aminobenzoyl-Ala-Thr-...
J Med Chem 40: 1465-74 (1997)
Article DOI: 10.1021/jm960839i
BindingDB Entry DOI: 10.7270/Q29021Z4