BDBM7018 (4R,5S,6S,7R)-1,3-dibenzyl-5,6-dihydroxy-4,7-bis[(4-methyl-3,4-dihydro-2H-1,4-benzoxazin-6-yl)methyl]-1,3-diazepan-2-one::(4R,5S,6S,7R)-Hexahydro-5,6-dihydroxy-1,3-bis(phenylmethyl)-4,7-bis((4-methyl-3,4-dihydro-2H-benzo[b][1,4]-oxazin-6-yl)methyl-2H-1,3-diazapin-2-one::Cyclic Urea Based HIV-1 Protease Inhibitor 24
SMILES: CN1CCOc2ccc(C[C@@H]3[C@H](O)[C@@H](O)[C@@H](Cc4ccc5OCCN(C)c5c4)N(Cc4ccccc4)C(=O)N3Cc3ccccc3)cc12
InChI Key: InChIKey=SMDNSMSAGVSMIP-HVYOWVPISA-N
Data: 1 KI
Activity Spreadsheet -- Enzyme Inhibition Constant Data from BindingDB
Found 1 hit for monomerid = 7018
Trg + Lig
Ki
nM
ΔG°
kcal/mole
IC50
nM
Kd
nM
EC50/IC50
nM
koff
s-1
kon
M-1s-1
pHTemp
°C
HIV-1 Protease
(Human immunodeficiency virus type 1)
BDBM7018
((4R,5S,6S,7R)-1,3-dibenzyl-5,6-dihydroxy-4,7-bis[(...)
Show SMILES CN1CCOc2ccc(C[C@@H]3[C@H](O)[C@@H](O)[C@@H](Cc4ccc5OCCN(C)c5c4)N(Cc4ccccc4)C(=O)N3Cc3ccccc3)cc12
Show InChI InChI=1S/C39H44N4O5/c1-40-17-19-47-35-15-13-29(21-31(35)40)23-33-37(44)38(45)34(24-30-14-16-36-32(22-30)41(2)18-20-48-36)43(26-28-11-7-4-8-12-28)39(46)42(33)25-27-9-5-3-6-10-27/h3-16,21-22,33-34,37-38,44-45H,17-20,23-26H2,1-2H3/t33-,34-,37+,38+/m1/s1
0.700 -13.0n/an/an/an/an/a5.537
DuPont Merck Pharmaceutical Company
Assay Description
Inhibition of HIV protease was measured by assay of the cleavage of a fluorescent peptide substrate. The fluorescent product (2-aminobenzoyl-Ala-Thr-...
J Med Chem 40: 1465-74 (1997)
Article DOI: 10.1021/jm960839i
BindingDB Entry DOI: 10.7270/Q29021Z4