BDBM70211 3-[3-(4-tert-butylphenyl)-1,2,4-oxadiazol-5-yl]-N-(3-methylphenyl)propanamide::3-[3-(4-tert-butylphenyl)-1,2,4-oxadiazol-5-yl]-N-(m-tolyl)propionamide::SR-03000001328::SR-03000001328-1::cid_2228044
SMILES: Cc1cccc(NC(=O)CCc2nc(no2)-c2ccc(cc2)C(C)(C)C)c1
InChI Key: InChIKey=KZYYRRLBHCDGCA-UHFFFAOYSA-N
Data: 1 IC50
Activity Spreadsheet -- Enzyme Inhibition Constant Data from BindingDB
Found 1 hit for monomerid = 70211
Trg + Lig
Ki
nM
ΔG°
kcal/mole
IC50
nM
Kd
nM
EC50/IC50
nM
koff
s-1
kon
M-1s-1
pHTemp
°C
Kruppel-like factor 5
(Homo sapiens (Human))
BDBM70211
(3-[3-(4-tert-butylphenyl)-1,2,4-oxadiazol-5-yl]-N-...)
Show SMILES Cc1cccc(NC(=O)CCc2nc(no2)-c2ccc(cc2)C(C)(C)C)c1
Show InChI InChI=1S/C22H25N3O2/c1-15-6-5-7-18(14-15)23-19(26)12-13-20-24-21(25-27-20)16-8-10-17(11-9-16)22(2,3)4/h5-11,14H,12-13H2,1-4H3,(H,23,26)
Reactome pathway
PCBioAssay
n/an/a 229n/an/an/an/an/an/a
The Scripps Research Institute Molecular Screening Center
Curated by PubChem BioAssay
Assay Description
Source (MLPCN Center Name): The Scripps Research Institute Molecular Screening Center Affiliation: The Scripps Research Institute, TSRI Assay Provide...
PubChem Bioassay (2010)
BindingDB Entry DOI: 10.7270/Q2Q52N2C