BDBM70220 3-[3-(4-tert-butylphenyl)-1,2,4-oxadiazol-5-yl]-N-(phenylmethyl)propanamide::N-benzyl-3-[3-(4-tert-butylphenyl)-1,2,4-oxadiazol-5-yl]propanamide::N-benzyl-3-[3-(4-tert-butylphenyl)-1,2,4-oxadiazol-5-yl]propionamide::SR-03000001348::SR-03000001348-1::cid_45281187
SMILES: CC(C)(C)c1ccc(cc1)-c1noc(CCC(=O)NCc2ccccc2)n1
InChI Key: InChIKey=VYPULFVHJVUSJD-UHFFFAOYSA-N
Data: 1 IC50
Activity Spreadsheet -- Enzyme Inhibition Constant Data from BindingDB
Found 1 hit for monomerid = 70220
Trg + Lig
Ki
nM
ΔG°
kcal/mole
IC50
nM
Kd
nM
EC50/IC50
nM
koff
s-1
kon
M-1s-1
pHTemp
°C
Kruppel-like factor 5
(Homo sapiens (Human))
BDBM70220
(3-[3-(4-tert-butylphenyl)-1,2,4-oxadiazol-5-yl]-N-...)
Show SMILES CC(C)(C)c1ccc(cc1)-c1noc(CCC(=O)NCc2ccccc2)n1
Show InChI InChI=1S/C22H25N3O2/c1-22(2,3)18-11-9-17(10-12-18)21-24-20(27-25-21)14-13-19(26)23-15-16-7-5-4-6-8-16/h4-12H,13-15H2,1-3H3,(H,23,26)
Reactome pathway
PCBioAssay
n/an/a 3.58E+3n/an/an/an/an/an/a
The Scripps Research Institute Molecular Screening Center
Curated by PubChem BioAssay
Assay Description
Source (MLPCN Center Name): The Scripps Research Institute Molecular Screening Center Affiliation: The Scripps Research Institute, TSRI Assay Provide...
PubChem Bioassay (2010)
BindingDB Entry DOI: 10.7270/Q2Q52N2C