BDBM7025 (4R,5S,6S,7R)-4,7-bis(2,3-dihydro-1,4-benzodioxin-6-ylmethyl)-5,6-dihydroxy-1,3-bis({[4-(hydroxymethyl)phenyl]methyl})-1,3-diazepan-2-one::(4R,5S,6S,7R)-Hexahydro-5,6-dihydroxy-1,3-bis((4-(hydroxymethyl)phenyl)methyl)-4,7-bis((3,4-(ethylenedioxy)phenyl)methyl)-2H-1,3-diazapin-2-one::Cyclic Urea Based HIV-1 Protease Inhibitor 27
SMILES: OCc1ccc(CN2[C@H](Cc3ccc4OCCOc4c3)[C@H](O)[C@@H](O)[C@@H](Cc3ccc4OCCOc4c3)N(Cc3ccc(CO)cc3)C2=O)cc1
InChI Key: InChIKey=UMKGIYRNMMTPJS-RGXXHLTKSA-N
Data: 1 KI
Activity Spreadsheet -- Enzyme Inhibition Constant Data from BindingDB
Found 1 hit for monomerid = 7025
Trg + Lig
Ki
nM
ΔG°
kcal/mole
IC50
nM
Kd
nM
EC50/IC50
nM
koff
s-1
kon
M-1s-1
pHTemp
°C
HIV-1 Protease
(Human immunodeficiency virus type 1)
BDBM7025
((4R,5S,6S,7R)-4,7-bis(2,3-dihydro-1,4-benzodioxin-...)
Show SMILES OCc1ccc(CN2[C@H](Cc3ccc4OCCOc4c3)[C@H](O)[C@@H](O)[C@@H](Cc3ccc4OCCOc4c3)N(Cc3ccc(CO)cc3)C2=O)cc1
Show InChI InChI=1S/C39H42N2O9/c42-23-27-5-1-25(2-6-27)21-40-31(17-29-9-11-33-35(19-29)49-15-13-47-33)37(44)38(45)32(18-30-10-12-34-36(20-30)50-16-14-48-34)41(39(40)46)22-26-3-7-28(24-43)8-4-26/h1-12,19-20,31-32,37-38,42-45H,13-18,21-24H2/t31-,32-,37+,38+/m1/s1
0.0500 -14.6n/an/an/an/an/a5.537
DuPont Merck Pharmaceutical Company
Assay Description
Inhibition of HIV protease was measured by assay of the cleavage of a fluorescent peptide substrate. The fluorescent product (2-aminobenzoyl-Ala-Thr-...
J Med Chem 40: 1465-74 (1997)
Article DOI: 10.1021/jm960839i
BindingDB Entry DOI: 10.7270/Q29021Z4