null
SMILES: Nc1nc(Nc2cc(Cl)c(c(Cl)c2)-c2cccc(c2)C(F)(F)F)n[nH]1
InChI Key: InChIKey=IZQWHJRCSSYTTE-UHFFFAOYSA-N
Activity Spreadsheet -- Enzyme Inhibition Constant Data from BindingDB
Found 1 hit for monomerid = 70438
Trg + Lig
Ki
nM
ΔG°
kcal/mole
IC50
nM
Kd
nM
EC50/IC50
nM
koff
s-1
kon
M-1s-1
pHTemp
°C
Genome polyprotein
(Hepatitis C virus (HCV genotype 1a, isolate H))
BDBM70438
(US9693997, 108)
Show SMILES Nc1nc(Nc2cc(Cl)c(c(Cl)c2)-c2cccc(c2)C(F)(F)F)n[nH]1
Show InChI InChI=1S/C15H10Cl2F3N5/c16-10-5-9(22-14-23-13(21)24-25-14)6-11(17)12(10)7-2-1-3-8(4-7)15(18,19)20/h1-6H,(H4,21,22,23,24,25)
US Patent
n/an/an/an/a 14n/an/an/an/a
HOFFMANN-LA ROCHE INC.
US Patent
Assay Description
Plasmids expressing HCV E1 and E2 envelope proteins of GT1a H77 strain (Proc Natl Acad Sci USA 1997 94:8738-43) or GT1b Con1 strain (Science 1999 285...
US Patent US9693997 (2017)
BindingDB Entry DOI: 10.7270/Q2833Q56