BDBM70582 2-Amino-1-benzo[1,3]dioxol-5-ylmethyl-1H-pyrrolo[2,3-b]quinoxaline-3-carboxylic acid butylamide::2-amino-1-(1,3-benzodioxol-5-ylmethyl)-N-butyl-3-pyrrolo[3,2-b]quinoxalinecarboxamide::2-amino-1-(1,3-benzodioxol-5-ylmethyl)-N-butylpyrrolo[3,2-b]quinoxaline-3-carboxamide::2-amino-N-butyl-1-piperonyl-pyrrolo[3,2-b]quinoxaline-3-carboxamide::2-azanyl-1-(1,3-benzodioxol-5-ylmethyl)-N-butyl-pyrrolo[3,2-b]quinoxaline-3-carboxamide::MLS000595299::SMR000149822::cid_1912468
SMILES: CCCCNC(=O)c1c(N)n(Cc2ccc3OCOc3c2)c2nc3ccccc3nc12
InChI Key: InChIKey=ZFBNEONZIBBYDW-UHFFFAOYSA-N
Data: 1 EC50
Activity Spreadsheet -- Enzyme Inhibition Constant Data from BindingDB
Found 1 hit for monomerid = 70582
Trg + Lig
Ki
nM
ΔG°
kcal/mole
IC50
nM
Kd
nM
EC50/IC50
nM
koff
s-1
kon
M-1s-1
pHTemp
°C
karyopherin alpha 2 (RAG cohort 1, importin alpha 1), isoform CRA_b
(Homo sapiens (Human))
BDBM70582
(2-Amino-1-benzo[1,3]dioxol-5-ylmethyl-1H-pyrrolo[2...)
Show SMILES CCCCNC(=O)c1c(N)n(Cc2ccc3OCOc3c2)c2nc3ccccc3nc12
Show InChI InChI=1S/C23H23N5O3/c1-2-3-10-25-23(29)19-20-22(27-16-7-5-4-6-15(16)26-20)28(21(19)24)12-14-8-9-17-18(11-14)31-13-30-17/h4-9,11H,2-3,10,12-13,24H2,1H3,(H,25,29)
Reactome pathway
PCBioAssay
n/an/an/an/a 3.12E+3n/an/an/an/a
Broad Institute
Curated by PubChem BioAssay
Assay Description
Keywords: Counterscreen, FRET assay, HTS, YIC probe, Dose response, Assay Overview: This is a fluorescence resonance energy transfer (FRET)-based b...
PubChem Bioassay (2010)
BindingDB Entry DOI: 10.7270/Q280513R