BDBM7086 N-(1H-1,3-benzodiazol-2-yl)-3-{[(4R,5S,6S,7R)-3-{[3-(1H-1,3-benzodiazol-2-ylcarbamoyl)phenyl]methyl}-5,6-dihydroxy-4,7-bis[(4-hydroxyphenyl)methyl]-2-oxo-1,3-diazepan-1-yl]methyl}benzamide::SD146 Analog 7
SMILES: O[C@@H]1[C@@H](O)[C@@H](Cc2ccc(O)cc2)N(Cc2cccc(c2)C(=O)Nc2nc3ccccc3[nH]2)C(=O)N(Cc2cccc(c2)C(=O)Nc2nc3ccccc3[nH]2)[C@@H]1Cc1ccc(O)cc1
InChI Key: InChIKey=HRYSVKPTFVWINZ-QHQGJXSCSA-N
Data: 1 KI
PDB links: 2 PDB IDs contain inhibitors having a similarity of 90% to this monomer.
Activity Spreadsheet -- Enzyme Inhibition Constant Data from BindingDB
Found 1 hit for monomerid = 7086
Trg + Lig
Ki
nM
ΔG°
kcal/mole
IC50
nM
Kd
nM
EC50/IC50
nM
koff
s-1
kon
M-1s-1
pHTemp
°C
HIV-1 Protease
(Human immunodeficiency virus type 1)
BDBM7086
(N-(1H-1,3-benzodiazol-2-yl)-3-{[(4R,5S,6S,7R)-3-{[...)
Show SMILES O[C@@H]1[C@@H](O)[C@@H](Cc2ccc(O)cc2)N(Cc2cccc(c2)C(=O)Nc2nc3ccccc3[nH]2)C(=O)N(Cc2cccc(c2)C(=O)Nc2nc3ccccc3[nH]2)[C@@H]1Cc1ccc(O)cc1
Show InChI InChI=1S/C49H44N8O7/c58-35-19-15-29(16-20-35)25-41-43(60)44(61)42(26-30-17-21-36(59)22-18-30)57(28-32-8-6-10-34(24-32)46(63)55-48-52-39-13-3-4-14-40(39)53-48)49(64)56(41)27-31-7-5-9-33(23-31)45(62)54-47-50-37-11-1-2-12-38(37)51-47/h1-24,41-44,58-61H,25-28H2,(H2,50,51,54,62)(H2,52,53,55,63)/t41-,42-,43+,44+/m1/s1
0.0350 -14.8n/an/an/an/an/a5.537
DuPont Merck Pharmaceutical Company
Assay Description
Inhibition of HIV protease was measured by assay of the cleavage of a fluorescent peptide substrate. The fluorescent product (2-aminobenzoyl-Ala-Thr-...
Bioorg Med Chem Lett 8: 1077-82 (1998)
Article DOI: 10.1016/s0960-894x(98)00175-9
BindingDB Entry DOI: 10.7270/Q21G0JGN