BDBM71006 US9546164, 155::US9694002, 155
SMILES: CCC(N1CCC(COc2cc(F)c(cc2C2CC2)C(=O)NS(C)(=O)=O)CC1)c1cc(Cl)cc(Cl)c1
InChI Key: InChIKey=CYZIUYSSULFUGZ-UHFFFAOYSA-N
Data: 2 IC50
Activity Spreadsheet -- Enzyme Inhibition Constant Data from BindingDB
Found 2 hits for monomerid = 71006
Trg + Lig
Ki
nM
ΔG°
kcal/mole
IC50
nM
Kd
nM
EC50/IC50
nM
koff
s-1
kon
M-1s-1
pHTemp
°C
Sodium channel protein type 5 subunit alpha
(Homo sapiens (Human))
BDBM71006
(US9546164, 155 | US9694002, 155)
Show SMILES CCC(N1CCC(COc2cc(F)c(cc2C2CC2)C(=O)NS(C)(=O)=O)CC1)c1cc(Cl)cc(Cl)c1
Show InChI InChI=1S/C26H31Cl2FN2O4S/c1-3-24(18-10-19(27)12-20(28)11-18)31-8-6-16(7-9-31)15-35-25-14-23(29)22(13-21(25)17-4-5-17)26(32)30-36(2,33)34/h10-14,16-17,24H,3-9,15H2,1-2H3,(H,30,32)
US Patent
n/an/a 2.02n/an/an/an/a7.425
GENENTECH, INC.; XENON PHARMACEUTICALS INC.
US Patent
Assay Description
Radioligand Binding Studies: Saturation experiments. A representative compound of formula (I) having a methyl group was tritiated. Three tritiums wer...
US Patent US9546164 (2017)
BindingDB Entry DOI: 10.7270/Q2JD4ZS4
Sodium Channel Complex
(Homo sapiens (Human))
BDBM71006
(US9546164, 155 | US9694002, 155)
Show SMILES CCC(N1CCC(COc2cc(F)c(cc2C2CC2)C(=O)NS(C)(=O)=O)CC1)c1cc(Cl)cc(Cl)c1
Show InChI InChI=1S/C26H31Cl2FN2O4S/c1-3-24(18-10-19(27)12-20(28)11-18)31-8-6-16(7-9-31)15-35-25-14-23(29)22(13-21(25)17-4-5-17)26(32)30-36(2,33)34/h10-14,16-17,24H,3-9,15H2,1-2H3,(H,30,32)
US Patent
n/an/a 2n/an/an/an/a7.425
GENENTECH, INC.; XENON PHARMACEUTICALS INC.
US Patent
Assay Description
Binding of this radioligand was preformed in 5 mL borosilicate glass test tubes at room temperature. Binding was initiated by adding membranes to inc...
US Patent US9694002 (2017)
BindingDB Entry DOI: 10.7270/Q24B2ZFG