BDBM7109 3-Aminopyrazole deriv. 21::N-(5-cyclopropyl-1H-pyrazol-3-yl)-2-[4-(2,5-dioxopyrrolidin-1-yl)phenyl]propanamide
SMILES: CC(C(=O)Nc1cc(n[nH]1)C1CC1)c1ccc(cc1)-n1c(O)ccc1O
InChI Key: InChIKey=MIHWBRIDGXHMIH-UHFFFAOYSA-N
Data: 1 IC50
Activity Spreadsheet -- Enzyme Inhibition Constant Data from BindingDB
Found 1 hit for monomerid = 7109
Trg + Lig
Ki
nM
ΔG°
kcal/mole
IC50
nM
Kd
nM
EC50/IC50
nM
koff
s-1
kon
M-1s-1
pHTemp
°C
Cyclin-Dependent Kinase 2 (CDK2)
(Homo sapiens (Human))
BDBM7109
(3-Aminopyrazole deriv. 21 | N-(5-cyclopropyl-1H-py...)
Show SMILES CC(C(=O)Nc1cc(n[nH]1)C1CC1)c1ccc(cc1)-n1c(O)ccc1O
Show InChI InChI=1S/C19H20N4O3/c1-11(19(26)20-16-10-15(21-22-16)13-2-3-13)12-4-6-14(7-5-12)23-17(24)8-9-18(23)25/h4-11,13,24-25H,2-3H2,1H3,(H2,20,21,22,26)
NCI pathway
Reactome pathway
n/an/a 77n/an/an/an/an/an/a
Nerviano Medical Sciences
Assay Description
The biochemical activity of compounds was determined by incubation with specific enzymes and substrates in the presence ATP/[gamma-33P] ATP. After in...
J Med Chem 48: 2944-56 (2005)
Article DOI: 10.1021/jm0408870
BindingDB Entry DOI: 10.7270/Q2WQ020R
3D
3D Structure (docked)