BDBM7129 3-Benzamidoaminopyrazole deriv. 6::4-chloro-N-(5-cyclopropyl-1H-pyrazol-3-yl)benzamide::CHEMBL115264::N-(5-Cyclopropyl-1H-pyrazol-3-yl)-4-chlorobenzamide
SMILES: Clc1ccc(cc1)C(=O)Nc1cc(n[nH]1)C1CC1
InChI Key: InChIKey=CXQJGJMKSNFPQC-UHFFFAOYSA-N
Data: 2 IC50
PDB links: 1 PDB ID contains inhibitors having a similarity of 90% to this monomer.
Activity Spreadsheet -- Enzyme Inhibition Constant Data from BindingDB
Found 2 hits for monomerid = 7129
Trg + Lig
Ki
nM
ΔG°
kcal/mole
IC50
nM
Kd
nM
EC50/IC50
nM
koff
s-1
kon
M-1s-1
pHTemp
°C
Cyclin-dependent kinase 2
(Homo sapiens (Human))
BDBM7129
(3-Benzamidoaminopyrazole deriv. 6 | 4-chloro-N-(5-...)
Show SMILES Clc1ccc(cc1)C(=O)Nc1cc(n[nH]1)C1CC1
Show InChI InChI=1S/C13H12ClN3O/c14-10-5-3-9(4-6-10)13(18)15-12-7-11(16-17-12)8-1-2-8/h3-8H,1-2H2,(H2,15,16,17,18)
NCI pathway
Reactome pathway
n/an/a 85n/an/an/an/an/an/a
Institute of Chemical Biology (CSIR)
Curated by ChEMBL
Assay Description
Inhibition of CDK2/Cyclin A (unknown origin)
Eur J Med Chem 43: 2807-18 (2008)
Article DOI: 10.1016/j.ejmech.2007.10.016
BindingDB Entry DOI: 10.7270/Q2MP5324
3D
3D Structure (docked)
Cyclin-Dependent Kinase 2 (CDK2)
(Homo sapiens (Human))
BDBM7129
(3-Benzamidoaminopyrazole deriv. 6 | 4-chloro-N-(5-...)
Show SMILES Clc1ccc(cc1)C(=O)Nc1cc(n[nH]1)C1CC1
Show InChI InChI=1S/C13H12ClN3O/c14-10-5-3-9(4-6-10)13(18)15-12-7-11(16-17-12)8-1-2-8/h3-8H,1-2H2,(H2,15,16,17,18)
NCI pathway
Reactome pathway
n/an/a 85n/an/an/an/a7.422
Pharmacia Italia
Assay Description
The biochemical activity of compounds was determined by incubation with specific enzymes and substrates in the presence ATP/[gamma-33P] ATP. After in...
J Med Chem 47: 3367-80 (2004)
Article DOI: 10.1021/jm031145u
BindingDB Entry DOI: 10.7270/Q2RX998G
3D
3D Structure (docked)