BDBM714 (4R)-N-tert-butyl-3-[(2S,3S)-2-hydroxy-3-[(3-hydroxy-2-methylphenyl)formamido]-4-phenylbutanoyl]-5,5-dimethyl-1,3-thiazolidine-4-carboxamide::(R)-N-tert-Butyl-3-[(2S,3S)-2-hydroxy-3-(3-hydroxy-2-methylbenzoyl)amino-4-phenylbutanoyl]-5,5-dimethyl-1,3-thiazolidine-4-carboxamide::JE-533
SMILES: Cc1c(O)cccc1C(=O)N[C@@H](Cc1ccccc1)[C@H](O)C(=O)N1CSC(C)(C)[C@H]1C(=O)NC(C)(C)C
InChI Key: InChIKey=CGFVYUGIPISJQG-ACIOBRDBSA-N
Data: 1 KI
PDB links: 2 PDB IDs match this monomer. 1 PDB ID contains inhibitors having a similarity of 90% to this monomer.
Activity Spreadsheet -- Enzyme Inhibition Constant Data from BindingDB
Found 1 hit for monomerid = 714
Trg + Lig
Ki
nM
ΔG°
kcal/mole
IC50
nM
Kd
nM
EC50/IC50
nM
koff
s-1
kon
M-1s-1
pHTemp
°C
HIV-1 Protease
(Human immunodeficiency virus type 1)
BDBM714
((4R)-N-tert-butyl-3-[(2S,3S)-2-hydroxy-3-[(3-hydro...)
Show SMILES Cc1c(O)cccc1C(=O)N[C@@H](Cc1ccccc1)[C@H](O)C(=O)N1CSC(C)(C)[C@H]1C(=O)NC(C)(C)C |r|
Show InChI InChI=1S/C28H37N3O5S/c1-17-19(13-10-14-21(17)32)24(34)29-20(15-18-11-8-7-9-12-18)22(33)26(36)31-16-37-28(5,6)23(31)25(35)30-27(2,3)4/h7-14,20,22-23,32-33H,15-16H2,1-6H3,(H,29,34)(H,30,35)/t20-,22-,23+/m0/s1
5.14 -11.8n/an/an/an/an/a6.037
Japan Energy Corporation
Assay Description
Sensitivity of HIV-1 protease activity to protease inhibitors was determined by a peptide substrate cleavage assay. Substrates and cleavage fragments...
J Med Chem 42: 1789-802 (1999)
Article DOI: 10.1021/jm980637h
BindingDB Entry DOI: 10.7270/Q2MG7MP3
3D
3D Structure (crystal)