BDBM71404 1-[3,5-bis(2-furanyl)-3,4-dihydropyrazol-2-yl]-2-chloroethanone::1-[3,5-bis(2-furyl)-2-pyrazolin-1-yl]-2-chloro-ethanone::1-[3,5-bis(furan-2-yl)-3,4-dihydropyrazol-2-yl]-2-chloranyl-ethanone::1-[3,5-bis(furan-2-yl)-3,4-dihydropyrazol-2-yl]-2-chloroethanone::MLS001179884::SMR000591924::cid_4961647
SMILES: ClCC(=O)N1N=C(CC1c1ccco1)c1ccco1
InChI Key: InChIKey=OPRWTSGLXDLNBZ-UHFFFAOYSA-N
Data: 3 IC50
Activity Spreadsheet -- Enzyme Inhibition Constant Data from BindingDB
Found 3 hits for monomerid = 71404
Trg + Lig
Ki
nM
ΔG°
kcal/mole
IC50
nM
Kd
nM
EC50/IC50
nM
koff
s-1
kon
M-1s-1
pHTemp
°C
nuclear receptor coactivator 3 isoform a
(Homo sapiens (Human))
BDBM71404
(1-[3,5-bis(2-furanyl)-3,4-dihydropyrazol-2-yl]-2-c...)
Show SMILES ClCC(=O)N1N=C(CC1c1ccco1)c1ccco1 |c:5|
Show InChI InChI=1S/C13H11ClN2O3/c14-8-13(17)16-10(12-4-2-6-19-12)7-9(15-16)11-3-1-5-18-11/h1-6,10H,7-8H2
Reactome pathway
PCBioAssay
n/an/a>1.33E+3n/an/an/an/an/an/a
The Scripps Research Institute Molecular Screening Center
Curated by PubChem BioAssay
Assay Description
Source (MLPCN Center Name): The Scripps Research Institute Molecular Screening Center (SRIMSC) Affiliation: The Scripps Research Institute, TSRI Assa...
PubChem Bioassay (2012)
BindingDB Entry DOI: 10.7270/Q2HT2MXV
Nuclear receptor coactivator 1
(Homo sapiens (Human))
BDBM71404
(1-[3,5-bis(2-furanyl)-3,4-dihydropyrazol-2-yl]-2-c...)
Show SMILES ClCC(=O)N1N=C(CC1c1ccco1)c1ccco1 |c:5|
Show InChI InChI=1S/C13H11ClN2O3/c14-8-13(17)16-10(12-4-2-6-19-12)7-9(15-16)11-3-1-5-18-11/h1-6,10H,7-8H2
Reactome pathway
PCBioAssay
n/an/a>3.59E+4n/an/an/an/an/an/a
The Scripps Research Institute Molecular Screening Center
Curated by PubChem BioAssay
Assay Description
Source (MLPCN Center Name): The Scripps Research Institute Molecular Screening Center (SRIMSC) Affiliation: The Scripps Research Institute, TSRI Assa...
PubChem Bioassay (2012)
BindingDB Entry DOI: 10.7270/Q28914F2
Alpha trans-inducing protein (VP16)
(Human herpesvirus 1 (strain 17) (HHV-1) (Human her...)
BDBM71404
(1-[3,5-bis(2-furanyl)-3,4-dihydropyrazol-2-yl]-2-c...)
Show SMILES ClCC(=O)N1N=C(CC1c1ccco1)c1ccco1 |c:5|
Show InChI InChI=1S/C13H11ClN2O3/c14-8-13(17)16-10(12-4-2-6-19-12)7-9(15-16)11-3-1-5-18-11/h1-6,10H,7-8H2
PCBioAssay
n/an/a>1.20E+4n/an/an/an/an/an/a
The Scripps Research Institute Molecular Screening Center
Curated by PubChem BioAssay
Assay Description
Source (MLPCN Center Name): The Scripps Research Institute Molecular Screening Center (SRIMSC) Affiliation: The Scripps Research Institute, TSRI Assa...
PubChem Bioassay (2012)
BindingDB Entry DOI: 10.7270/Q2D21W6V