BDBM7161 3-Phenylacetamidoaminopyrazole deriv. 38::4 -{2-[(5-Cyclopropyl-1H-pyrazol-3-yl)amino]-2-oxoethyl}-1,1 -biphenyl-4-carboxylic acid::4-(4-{[(5-cyclopropyl-1H-pyrazol-3-yl)carbamoyl]methyl}phenyl)benzoic acid
SMILES: OC(=O)c1ccc(cc1)-c1ccc(CC(=O)Nc2cc(n[nH]2)C2CC2)cc1
InChI Key: InChIKey=JNMFNQYJOKDMNT-UHFFFAOYSA-N
Data: 1 IC50
PDB links: 1 PDB ID contains inhibitors having a similarity of 90% to this monomer.
Activity Spreadsheet -- Enzyme Inhibition Constant Data from BindingDB
Found 1 hit for monomerid = 7161
Trg + Lig
Ki
nM
ΔG°
kcal/mole
IC50
nM
Kd
nM
EC50/IC50
nM
koff
s-1
kon
M-1s-1
pHTemp
°C
Cyclin-Dependent Kinase 2 (CDK2)
(Homo sapiens (Human))
BDBM7161
(3-Phenylacetamidoaminopyrazole deriv. 38 | 4 -{2-[...)
Show SMILES OC(=O)c1ccc(cc1)-c1ccc(CC(=O)Nc2cc(n[nH]2)C2CC2)cc1
Show InChI InChI=1S/C21H19N3O3/c25-20(22-19-12-18(23-24-19)16-7-8-16)11-13-1-3-14(4-2-13)15-5-9-17(10-6-15)21(26)27/h1-6,9-10,12,16H,7-8,11H2,(H,26,27)(H2,22,23,24,25)
NCI pathway
Reactome pathway
n/an/a 11n/an/an/an/an/an/a
Pharmacia Italia
Assay Description
The biochemical activity of compounds was determined by incubation with specific enzymes and substrates in the presence ATP/[gamma-33P] ATP. After in...
J Med Chem 47: 3367-80 (2004)
Article DOI: 10.1021/jm031145u
BindingDB Entry DOI: 10.7270/Q2RX998G