BDBM7167 3-(4-sulfamoylphenyl)-3,4,10,11-tetraazatricyclo[7.3.0.0^{2,6}]dodeca-1(9),2(6),4,7,11-pentaene-5-carboxamide::dihydro-benzodipyrazole deriv. 7a
SMILES: NC(=O)c1nn(-c2ccc(cc2)S(N)(=O)=O)c2c1ccc1[nH]ncc21
InChI Key: InChIKey=HGAKLLFPOGATII-UHFFFAOYSA-N
Data: 1 IC50
PDB links: 1 PDB ID matches this monomer.
Activity Spreadsheet -- Enzyme Inhibition Constant Data from BindingDB
Found 1 hit for monomerid = 7167
Trg + Lig
Ki
nM
ΔG°
kcal/mole
IC50
nM
Kd
nM
EC50/IC50
nM
koff
s-1
kon
M-1s-1
pHTemp
°C
Cyclin-Dependent Kinase 2 (CDK2)
(Homo sapiens (Human))
BDBM7167
(3-(4-sulfamoylphenyl)-3,4,10,11-tetraazatricyclo[7...)
Show SMILES NC(=O)c1nn(-c2ccc(cc2)S(N)(=O)=O)c2c1ccc1[nH]ncc21
Show InChI InChI=1S/C15H12N6O3S/c16-15(22)13-10-5-6-12-11(7-18-19-12)14(10)21(20-13)8-1-3-9(4-2-8)25(17,23)24/h1-7H,(H2,16,22)(H,18,19)(H2,17,23,24)
NCI pathway
Reactome pathway
n/an/a 0.300n/an/an/an/a7.422
Nerviano Medical Sciences
Assay Description
The biochemical activity of compounds was determined by incubation with specific enzymes and substrates in the presence ATP/[gamma-33P] ATP. After in...
Bioorg Med Chem Lett 15: 1315-9 (2005)
Article DOI: 10.1016/j.bmcl.2005.01.023
BindingDB Entry DOI: 10.7270/Q2N58JKH
3D
3D Structure (crystal)