BDBM7183 3-(4-methylphenyl)-3,4,10,11-tetraazatricyclo[7.3.0.0^{2,6}]dodeca-1(9),2(6),4,7,11-pentaene-5-carboxamide::dihydro-benzodipyrazole deriv. 7i
SMILES: Cc1ccc(cc1)-n1nc(C(N)=O)c2ccc3[nH]ncc3c12
InChI Key: InChIKey=RVGFQABNRSQREF-UHFFFAOYSA-N
Data: 1 IC50
Activity Spreadsheet -- Enzyme Inhibition Constant Data from BindingDB
Found 1 hit for monomerid = 7183
Trg + Lig
Ki
nM
ΔG°
kcal/mole
IC50
nM
Kd
nM
EC50/IC50
nM
koff
s-1
kon
M-1s-1
pHTemp
°C
Cyclin-Dependent Kinase 2 (CDK2)
(Homo sapiens (Human))
BDBM7183
(3-(4-methylphenyl)-3,4,10,11-tetraazatricyclo[7.3....)
Show SMILES Cc1ccc(cc1)-n1nc(C(N)=O)c2ccc3[nH]ncc3c12
Show InChI InChI=1S/C16H13N5O/c1-9-2-4-10(5-3-9)21-15-11(14(20-21)16(17)22)6-7-13-12(15)8-18-19-13/h2-8H,1H3,(H2,17,22)(H,18,19)
NCI pathway
Reactome pathway
n/an/a 15n/an/an/an/an/an/a
Nerviano Medical Sciences
Assay Description
The biochemical activity of compounds was determined by incubation with specific enzymes and substrates in the presence ATP/[gamma-33P] ATP. After in...
Bioorg Med Chem Lett 15: 1315-9 (2005)
Article DOI: 10.1016/j.bmcl.2005.01.023
BindingDB Entry DOI: 10.7270/Q2N58JKH
3D
3D Structure (docked)