BDBM7214 3-(2,2,2-trifluoroethyl)-3,4,10,11-tetraazatricyclo[7.3.0.0^{2,6}]dodeca-1(9),2(6),4,7,11-pentaene-5-carboxamide::dihydro-benzodipyrazole deriv. 7y
SMILES: NC(=O)c1nn(CC(F)(F)F)c2c1ccc1[nH]ncc21
InChI Key: InChIKey=KUCYABDDCHEOBN-UHFFFAOYSA-N
Data: 1 IC50
Activity Spreadsheet -- Enzyme Inhibition Constant Data from BindingDB
Found 1 hit for monomerid = 7214
Trg + Lig
Ki
nM
ΔG°
kcal/mole
IC50
nM
Kd
nM
EC50/IC50
nM
koff
s-1
kon
M-1s-1
pHTemp
°C
Cyclin-Dependent Kinase 2 (CDK2)
(Homo sapiens (Human))
BDBM7214
(3-(2,2,2-trifluoroethyl)-3,4,10,11-tetraazatricycl...)
Show SMILES NC(=O)c1nn(CC(F)(F)F)c2c1ccc1[nH]ncc21
Show InChI InChI=1S/C11H8F3N5O/c12-11(13,14)4-19-9-5(8(18-19)10(15)20)1-2-7-6(9)3-16-17-7/h1-3H,4H2,(H2,15,20)(H,16,17)
NCI pathway
Reactome pathway
n/an/a 2n/an/an/an/an/an/a
Nerviano Medical Sciences
Assay Description
The biochemical activity of compounds was determined by incubation with specific enzymes and substrates in the presence ATP/[gamma-33P] ATP. After in...
Bioorg Med Chem Lett 15: 1315-9 (2005)
Article DOI: 10.1016/j.bmcl.2005.01.023
BindingDB Entry DOI: 10.7270/Q2N58JKH