BDBM7241 (3Z)-2-oxo-3-({4-oxo-2H,4H,6H,7H-pyrano[3,4-c]pyrrol-1-yl}methylidene)-2,3-dihydro-1H-indole-5-sulfonamide::pyrrollylactone indolinone driv. 15c
SMILES: NS(=O)(=O)c1ccc2NC(=O)\C(=C/c3[nH]cc4c3CCOC4=O)c2c1
InChI Key: InChIKey=HHNLJCDJQYVVOF-WDZFZDKYSA-N
Data: 4 IC50
Activity Spreadsheet -- Enzyme Inhibition Constant Data from BindingDB
Found 4 hits for monomerid = 7241
Trg + Lig
Ki
nM
ΔG°
kcal/mole
IC50
nM
Kd
nM
EC50/IC50
nM
koff
s-1
kon
M-1s-1
pHTemp
°C
CDK2/CycE
(Homo sapiens (Human))
BDBM7241
((3Z)-2-oxo-3-({4-oxo-2H,4H,6H,7H-pyrano[3,4-c]pyrr...)
Show SMILES NS(=O)(=O)c1ccc2NC(=O)\C(=C/c3[nH]cc4c3CCOC4=O)c2c1
Show InChI InChI=1S/C16H13N3O5S/c17-25(22,23)8-1-2-13-10(5-8)11(15(20)19-13)6-14-9-3-4-24-16(21)12(9)7-18-14/h1-2,5-7,18H,3-4H2,(H,19,20)(H2,17,22,23)/b11-6-
n/an/a 12n/an/an/an/a7.422
SUGEN, Inc.
Assay Description
For the assay, purified cdk/cyclin was added to polystyrene 96-well plates that were precoated with GST-Rb substrate in the presence of ATP. After i...
Bioorg Med Chem Lett 13: 1939-42 (2003)
Article DOI: 10.1016/s0960-894x(03)00312-3
BindingDB Entry DOI: 10.7270/Q2HD7SW7
Proto-oncogene tyrosine-protein kinase Src
(Homo sapiens (Human))
BDBM7241
((3Z)-2-oxo-3-({4-oxo-2H,4H,6H,7H-pyrano[3,4-c]pyrr...)
Show SMILES NS(=O)(=O)c1ccc2NC(=O)\C(=C/c3[nH]cc4c3CCOC4=O)c2c1
Show InChI InChI=1S/C16H13N3O5S/c17-25(22,23)8-1-2-13-10(5-8)11(15(20)19-13)6-14-9-3-4-24-16(21)12(9)7-18-14/h1-2,5-7,18H,3-4H2,(H,19,20)(H2,17,22,23)/b11-6-
n/an/a 1.30E+4n/an/an/an/an/a25
SUGEN, Inc.
Assay Description
The assays were performed in 96-well microtiter plates that had been coated with a polyGluTyr peptide. Negative control wells received buffer alone w...
Bioorg Med Chem Lett 13: 1939-42 (2003)
Article DOI: 10.1016/s0960-894x(03)00312-3
BindingDB Entry DOI: 10.7270/Q2HD7SW7
Platelet-derived growth factor receptor beta
(Homo sapiens (Human))
BDBM7241
((3Z)-2-oxo-3-({4-oxo-2H,4H,6H,7H-pyrano[3,4-c]pyrr...)
Show SMILES NS(=O)(=O)c1ccc2NC(=O)\C(=C/c3[nH]cc4c3CCOC4=O)c2c1
Show InChI InChI=1S/C16H13N3O5S/c17-25(22,23)8-1-2-13-10(5-8)11(15(20)19-13)6-14-9-3-4-24-16(21)12(9)7-18-14/h1-2,5-7,18H,3-4H2,(H,19,20)(H2,17,22,23)/b11-6-
NCI pathway
Reactome pathway
n/an/a>2.00E+4n/an/an/an/an/a25
SUGEN, Inc.
Assay Description
IC50 is the inhibitor concentration which inhibits 50% of PDGFR-beta kinase autophosphorylation activity. The assay was performed in 96-well microtit...
Bioorg Med Chem Lett 13: 1939-42 (2003)
Article DOI: 10.1016/s0960-894x(03)00312-3
BindingDB Entry DOI: 10.7270/Q2HD7SW7
Vascular endothelial growth factor receptor 2
(Homo sapiens (Human))
BDBM7241
((3Z)-2-oxo-3-({4-oxo-2H,4H,6H,7H-pyrano[3,4-c]pyrr...)
Show SMILES NS(=O)(=O)c1ccc2NC(=O)\C(=C/c3[nH]cc4c3CCOC4=O)c2c1
Show InChI InChI=1S/C16H13N3O5S/c17-25(22,23)8-1-2-13-10(5-8)11(15(20)19-13)6-14-9-3-4-24-16(21)12(9)7-18-14/h1-2,5-7,18H,3-4H2,(H,19,20)(H2,17,22,23)/b11-6-
NCI pathway
Reactome pathway
n/an/a 6.60E+3n/an/an/an/an/a25
SUGEN, Inc.
Assay Description
The assays were performed in 96-well microtiter plates that had been coated with a polyGluTyr peptide. Negative control wells received buffer alone w...
Bioorg Med Chem Lett 13: 1939-42 (2003)
Article DOI: 10.1016/s0960-894x(03)00312-3
BindingDB Entry DOI: 10.7270/Q2HD7SW7