BDBM7243 (3Z)-N,N-dimethyl-2-oxo-3-({4-oxo-2H,4H,6H,7H-pyrano[3,4-c]pyrrol-1-yl}methylidene)-2,3-dihydro-1H-indole-5-sulfonamide::pyrrollylactone indolinone driv. 15e
SMILES: CN(C)S(=O)(=O)c1ccc2NC(=O)\C(=C/c3[nH]cc4c3CCOC4=O)c2c1
InChI Key: InChIKey=HYFAEVUXFBZHKP-JYRVWZFOSA-N
Data: 4 IC50
Activity Spreadsheet -- Enzyme Inhibition Constant Data from BindingDB
Found 4 hits for monomerid = 7243
Trg + Lig
Ki
nM
ΔG°
kcal/mole
IC50
nM
Kd
nM
EC50/IC50
nM
koff
s-1
kon
M-1s-1
pHTemp
°C
CDK2/CycE
(Homo sapiens (Human))
BDBM7243
((3Z)-N,N-dimethyl-2-oxo-3-({4-oxo-2H,4H,6H,7H-pyra...)
Show SMILES CN(C)S(=O)(=O)c1ccc2NC(=O)\C(=C/c3[nH]cc4c3CCOC4=O)c2c1
Show InChI InChI=1S/C18H17N3O5S/c1-21(2)27(24,25)10-3-4-15-12(7-10)13(17(22)20-15)8-16-11-5-6-26-18(23)14(11)9-19-16/h3-4,7-9,19H,5-6H2,1-2H3,(H,20,22)/b13-8-
n/an/a 33n/an/an/an/a7.422
SUGEN, Inc.
Assay Description
For the assay, purified cdk/cyclin was added to polystyrene 96-well plates that were precoated with GST-Rb substrate in the presence of ATP. After i...
Bioorg Med Chem Lett 13: 1939-42 (2003)
Article DOI: 10.1016/s0960-894x(03)00312-3
BindingDB Entry DOI: 10.7270/Q2HD7SW7
Proto-oncogene tyrosine-protein kinase Src
(Homo sapiens (Human))
BDBM7243
((3Z)-N,N-dimethyl-2-oxo-3-({4-oxo-2H,4H,6H,7H-pyra...)
Show SMILES CN(C)S(=O)(=O)c1ccc2NC(=O)\C(=C/c3[nH]cc4c3CCOC4=O)c2c1
Show InChI InChI=1S/C18H17N3O5S/c1-21(2)27(24,25)10-3-4-15-12(7-10)13(17(22)20-15)8-16-11-5-6-26-18(23)14(11)9-19-16/h3-4,7-9,19H,5-6H2,1-2H3,(H,20,22)/b13-8-
n/an/a>2.00E+4n/an/an/an/an/a25
SUGEN, Inc.
Assay Description
The assays were performed in 96-well microtiter plates that had been coated with a polyGluTyr peptide. Negative control wells received buffer alone w...
Bioorg Med Chem Lett 13: 1939-42 (2003)
Article DOI: 10.1016/s0960-894x(03)00312-3
BindingDB Entry DOI: 10.7270/Q2HD7SW7
Platelet-derived growth factor receptor beta
(Homo sapiens (Human))
BDBM7243
((3Z)-N,N-dimethyl-2-oxo-3-({4-oxo-2H,4H,6H,7H-pyra...)
Show SMILES CN(C)S(=O)(=O)c1ccc2NC(=O)\C(=C/c3[nH]cc4c3CCOC4=O)c2c1
Show InChI InChI=1S/C18H17N3O5S/c1-21(2)27(24,25)10-3-4-15-12(7-10)13(17(22)20-15)8-16-11-5-6-26-18(23)14(11)9-19-16/h3-4,7-9,19H,5-6H2,1-2H3,(H,20,22)/b13-8-
NCI pathway
Reactome pathway
n/an/a>2.00E+4n/an/an/an/an/a25
SUGEN, Inc.
Assay Description
IC50 is the inhibitor concentration which inhibits 50% of PDGFR-beta kinase autophosphorylation activity. The assay was performed in 96-well microtit...
Bioorg Med Chem Lett 13: 1939-42 (2003)
Article DOI: 10.1016/s0960-894x(03)00312-3
BindingDB Entry DOI: 10.7270/Q2HD7SW7
Vascular endothelial growth factor receptor 2
(Homo sapiens (Human))
BDBM7243
((3Z)-N,N-dimethyl-2-oxo-3-({4-oxo-2H,4H,6H,7H-pyra...)
Show SMILES CN(C)S(=O)(=O)c1ccc2NC(=O)\C(=C/c3[nH]cc4c3CCOC4=O)c2c1
Show InChI InChI=1S/C18H17N3O5S/c1-21(2)27(24,25)10-3-4-15-12(7-10)13(17(22)20-15)8-16-11-5-6-26-18(23)14(11)9-19-16/h3-4,7-9,19H,5-6H2,1-2H3,(H,20,22)/b13-8-
NCI pathway
Reactome pathway
n/an/a>2.00E+4n/an/an/an/an/a25
SUGEN, Inc.
Assay Description
The assays were performed in 96-well microtiter plates that had been coated with a polyGluTyr peptide. Negative control wells received buffer alone w...
Bioorg Med Chem Lett 13: 1939-42 (2003)
Article DOI: 10.1016/s0960-894x(03)00312-3
BindingDB Entry DOI: 10.7270/Q2HD7SW7