BDBM728 (3S)-oxolan-3-yl N-[(2S,3S)-4-[(2S)-2-benzyl-3-oxo-4-(1-oxo-1,2,3,4-tetrahydroisoquinolin-4-yl)-2,3-dihydro-1H-pyrrol-2-yl]-3-hydroxy-1-phenylbutan-2-yl]carbamate::Pyrrolinone deriv. 9::Pyrrolinone inhibitor 9::Tetrahydroisoquinolyl Inhibitor::monopyrrolinone-based inhibitor (+)-3::monopyrrolinone-based inhibitor 3
SMILES: O[C@@H](C[C@]1(Cc2ccccc2)N=CC(C2CNC(=O)c3ccccc23)C1=O)[C@H](Cc1ccccc1)NC(=O)O[C@H]1CCOC1
InChI Key: InChIKey=RROHLUJAQRVJPX-GHJDJLJMSA-N
Data: 2 IC50
PDB links: 1 PDB ID matches this monomer.
Activity Spreadsheet -- Enzyme Inhibition Constant Data from BindingDB
Found 2 hits for monomerid = 728
Trg + Lig
Ki
nM
ΔG°
kcal/mole
IC50
nM
Kd
nM
EC50/IC50
nM
koff
s-1
kon
M-1s-1
pHTemp
°C
HIV-1 Protease
(Human immunodeficiency virus type 1)
BDBM728
((3S)-oxolan-3-yl N-[(2S,3S)-4-[(2S)-2-benzyl-3-oxo...)
Show SMILES O[C@@H](C[C@]1(Cc2ccccc2)N=CC(C2CNC(=O)c3ccccc23)C1=O)[C@H](Cc1ccccc1)NC(=O)O[C@H]1CCOC1 |r,c:12|
Show InChI InChI=1S/C35H37N3O6/c39-31(30(17-23-9-3-1-4-10-23)38-34(42)44-25-15-16-43-22-25)19-35(18-24-11-5-2-6-12-24)32(40)29(21-37-35)28-20-36-33(41)27-14-8-7-13-26(27)28/h1-14,21,25,28-31,39H,15-20,22H2,(H,36,41)(H,38,42)/t25-,28?,29?,30-,31-,35-/m0/s1
n/an/a 5.70n/an/an/an/a5.530
University of Pennsylvania
Assay Description
The inhibition of HIV-1 protease activities were measured with peptide hydrolysis assays. The appearance of products and the corresponding loss of su...
Bioorg Med Chem Lett 16: 859-63 (2006)
Article DOI: 10.1016/j.bmcl.2005.11.011
BindingDB Entry DOI: 10.7270/Q29K48FX
3D
3D Structure (crystal)
HIV-1 Protease
(Human immunodeficiency virus type 1)
BDBM728
((3S)-oxolan-3-yl N-[(2S,3S)-4-[(2S)-2-benzyl-3-oxo...)
Show SMILES O[C@@H](C[C@]1(Cc2ccccc2)N=CC(C2CNC(=O)c3ccccc23)C1=O)[C@H](Cc1ccccc1)NC(=O)O[C@H]1CCOC1 |r,c:12|
Show InChI InChI=1S/C35H37N3O6/c39-31(30(17-23-9-3-1-4-10-23)38-34(42)44-25-15-16-43-22-25)19-35(18-24-11-5-2-6-12-24)32(40)29(21-37-35)28-20-36-33(41)27-14-8-7-13-26(27)28/h1-14,21,25,28-31,39H,15-20,22H2,(H,36,41)(H,38,42)/t25-,28?,29?,30-,31-,35-/m0/s1
n/an/a 5.70n/an/an/an/a5.530
University of Pennsylvania
Assay Description
All enzyme assays were performed under initial velocity and steady-state conditions. The conditions for the enzyme catalyzed hydrolysis of the cleava...
J Med Chem 46: 1831-44 (2003)
Article DOI: 10.1021/jm0204587
BindingDB Entry DOI: 10.7270/Q2GQ6VZC
3D
3D Structure (crystal)