BDBM730 Palinavir deriv. 2::benzyl N-[(2S,3R)-4-[(2S,4R)-2-(tert-butylcarbamoyl)-4-(pyridin-4-ylmethoxy)piperidin-1-yl]-3-hydroxy-1-phenylbutan-2-yl]carbamate
SMILES: CC(C)(C)NC(=O)[C@@H]1C[C@@H](CCN1C[C@@H](O)[C@H](Cc1ccccc1)NC(=O)OCc1ccccc1)OCc1ccncc1
InChI Key: InChIKey=WAHBCPQDHASNLU-QNRWOPMTSA-N
Data: 1 IC50
Activity Spreadsheet -- Enzyme Inhibition Constant Data from BindingDB
Found 1 hit for monomerid = 730
Trg + Lig
Ki
nM
ΔG°
kcal/mole
IC50
nM
Kd
nM
EC50/IC50
nM
koff
s-1
kon
M-1s-1
pHTemp
°C
HIV-1 Protease
(Human immunodeficiency virus type 1)
BDBM730
(Palinavir deriv. 2 | benzyl N-[(2S,3R)-4-[(2S,4R)-...)
Show SMILES CC(C)(C)NC(=O)[C@@H]1C[C@@H](CCN1C[C@@H](O)[C@H](Cc1ccccc1)NC(=O)OCc1ccccc1)OCc1ccncc1 |r|
Show InChI InChI=1S/C34H44N4O5/c1-34(2,3)37-32(40)30-21-28(42-23-27-14-17-35-18-15-27)16-19-38(30)22-31(39)29(20-25-10-6-4-7-11-25)36-33(41)43-24-26-12-8-5-9-13-26/h4-15,17-18,28-31,39H,16,19-24H2,1-3H3,(H,36,41)(H,37,40)/t28-,29+,30+,31-/m1/s1
n/an/a 400n/an/an/an/a5.537
Boehringer Ingelheim Pharmaceuticals Inc.
Assay Description
Sensitivity of HIV-1 protease activity to protease inhibitors was determined by a peptide substrate cleavage assay. Cleavage products and substrate w...
J Med Chem 43: 1094-108 (2000)
Article DOI: 10.1021/jm990336n
BindingDB Entry DOI: 10.7270/Q2BZ647F