BDBM7330 2-Methoxy-9-nitro-7,12-dihydro-indolo[3,2-d][1]benzazepin-6(5H)-one::4-methoxy-14-nitro-8,18-diazatetracyclo[9.7.0.0^{2,7}.0^{12,17}]octadeca-1(11),2,4,6,12(17),13,15-heptaen-9-one::NSC 720310::Paullone Analogue 65
SMILES: COc1ccc2NC(=O)Cc3c([nH]c4ccc(cc34)[N+]([O-])=O)-c2c1
InChI Key: InChIKey=BRQIEVOYMRUXNP-UHFFFAOYSA-N
Data: 3 IC50
PDB links: 1 PDB ID contains inhibitors having a similarity of 90% to this monomer.
Activity Spreadsheet -- Enzyme Inhibition Constant Data from BindingDB
Found 3 hits for monomerid = 7330
Trg + Lig
Ki
nM
ΔG°
kcal/mole
IC50
nM
Kd
nM
EC50/IC50
nM
koff
s-1
kon
M-1s-1
pHTemp
°C
Cyclin-Dependent Kinase 1 (CDK1)
(Marthasterias glacialis (starfish))
BDBM7330
(2-Methoxy-9-nitro-7,12-dihydro-indolo[3,2-d][1]ben...)
Show SMILES COc1ccc2NC(=O)Cc3c([nH]c4ccc(cc34)[N+]([O-])=O)-c2c1
Show InChI InChI=1S/C17H13N3O4/c1-24-10-3-5-15-13(7-10)17-12(8-16(21)18-15)11-6-9(20(22)23)2-4-14(11)19-17/h2-7,19H,8H2,1H3,(H,18,21)
n/an/a 80n/an/an/an/a7.230
Universitat Hamburg
Assay Description
Kinase activities were assayed in buffers containing substrate, enzyme, and inhibitor at 30 °C in the presence of 15 uM ATP/ [gamma-32P] ATP. 32...
J Med Chem 47: 22-36 (2004)
Article DOI: 10.1021/jm0308904
BindingDB Entry DOI: 10.7270/Q28050TR
Glycogen Synthase Kinase-3, beta
(Rattus norvegicus (rat))
BDBM7330
(2-Methoxy-9-nitro-7,12-dihydro-indolo[3,2-d][1]ben...)
Show SMILES COc1ccc2NC(=O)Cc3c([nH]c4ccc(cc34)[N+]([O-])=O)-c2c1
Show InChI InChI=1S/C17H13N3O4/c1-24-10-3-5-15-13(7-10)17-12(8-16(21)18-15)11-6-9(20(22)23)2-4-14(11)19-17/h2-7,19H,8H2,1H3,(H,18,21)
Reactome pathway
n/an/a 22n/an/an/an/an/a30
Universitat Hamburg
Assay Description
Kinase activities were assayed in buffers containing substrate, enzyme, and inhibitor at 30 °C in the presence of 15 uM ATP/ [gamma-32P] ATP. 32...
J Med Chem 47: 22-36 (2004)
Article DOI: 10.1021/jm0308904
BindingDB Entry DOI: 10.7270/Q28050TR
Cyclin-Dependent Kinase 5 (CDK5)
(Homo sapiens (Human))
BDBM7330
(2-Methoxy-9-nitro-7,12-dihydro-indolo[3,2-d][1]ben...)
Show SMILES COc1ccc2NC(=O)Cc3c([nH]c4ccc(cc34)[N+]([O-])=O)-c2c1
Show InChI InChI=1S/C17H13N3O4/c1-24-10-3-5-15-13(7-10)17-12(8-16(21)18-15)11-6-9(20(22)23)2-4-14(11)19-17/h2-7,19H,8H2,1H3,(H,18,21)
NCI pathway
Reactome pathway
n/an/a 70n/an/an/an/an/a30
Universitat Hamburg
Assay Description
Kinase activities were assayed in buffers containing substrate, enzyme, and inhibitor at 30 °C in the presence of 15 uM ATP/ [gamma-32P] ATP. 32...
J Med Chem 47: 22-36 (2004)
Article DOI: 10.1021/jm0308904
BindingDB Entry DOI: 10.7270/Q28050TR