BDBM741 (2S,4R)-N-tert-butyl-1-[(2R,3S)-3-[2-(2,6-dimethylphenoxy)acetamido]-2-hydroxy-4-phenylbutyl]-4-(pyridin-4-ylmethoxy)piperidine-2-carboxamide::Palinavir deriv. 13
SMILES: Cc1cccc(C)c1OCC(=O)N[C@@H](Cc1ccccc1)[C@H](O)CN1CC[C@H](C[C@H]1C(=O)NC(C)(C)C)OCc1ccncc1
InChI Key: InChIKey=YNTKPAFJCHPPOK-OKDNLZPVSA-N
Data: 1 IC50
Activity Spreadsheet -- Enzyme Inhibition Constant Data from BindingDB
Found 1 hit for monomerid = 741
Trg + Lig
Ki
nM
ΔG°
kcal/mole
IC50
nM
Kd
nM
EC50/IC50
nM
koff
s-1
kon
M-1s-1
pHTemp
°C
HIV-1 Protease
(Human immunodeficiency virus type 1)
BDBM741
((2S,4R)-N-tert-butyl-1-[(2R,3S)-3-[2-(2,6-dimethyl...)
Show SMILES Cc1cccc(C)c1OCC(=O)N[C@@H](Cc1ccccc1)[C@H](O)CN1CC[C@H](C[C@H]1C(=O)NC(C)(C)C)OCc1ccncc1 |r|
Show InChI InChI=1S/C36H48N4O5/c1-25-10-9-11-26(2)34(25)45-24-33(42)38-30(20-27-12-7-6-8-13-27)32(41)22-40-19-16-29(44-23-28-14-17-37-18-15-28)21-31(40)35(43)39-36(3,4)5/h6-15,17-18,29-32,41H,16,19-24H2,1-5H3,(H,38,42)(H,39,43)/t29-,30+,31+,32-/m1/s1
n/an/a 7n/an/an/an/a5.537
Boehringer Ingelheim Pharmaceuticals Inc.
Assay Description
Sensitivity of HIV-1 protease activity to protease inhibitors was determined by a peptide substrate cleavage assay. Cleavage products and substrate w...
J Med Chem 43: 1094-108 (2000)
Article DOI: 10.1021/jm990336n
BindingDB Entry DOI: 10.7270/Q2BZ647F