BDBM7424 (2 Z,3 E)-5,6-Dichloroindirubin-3 -oxime::5,6-dichloro-3-[(2Z,3E)-3-(hydroxyimino)-2,3-dihydro-1H-indol-2-ylidene]-2,3-dihydro-1H-indol-2-one::6,5-dichloroindirubin-3 -oxime::indirubin deriv. 7e
SMILES: Clc1cc2NC(=O)C(c2cc1Cl)c1[nH]c2ccccc2c1N=O
InChI Key: InChIKey=IPXGISYXWHSREN-UHFFFAOYSA-N
Data: 3 IC50
PDB links: 2 PDB IDs contain inhibitors having a similarity of 90% to this monomer.
Activity Spreadsheet -- Enzyme Inhibition Constant Data from BindingDB
Found 3 hits for monomerid = 7424
Trg + Lig
Ki
nM
ΔG°
kcal/mole
IC50
nM
Kd
nM
EC50/IC50
nM
koff
s-1
kon
M-1s-1
pHTemp
°C
Cyclin-Dependent Kinase 5 (CDK5)
(Homo sapiens (Human))
BDBM7424
((2 Z,3 E)-5,6-Dichloroindirubin-3 -oxime | 5,6-dic...)
Show SMILES Clc1cc2NC(=O)C(c2cc1Cl)c1[nH]c2ccccc2c1N=O
Show InChI InChI=1S/C16H9Cl2N3O2/c17-9-5-8-12(6-10(9)18)20-16(22)13(8)15-14(21-23)7-3-1-2-4-11(7)19-15/h1-6,13,19H,(H,20,22)
NCI pathway
Reactome pathway
n/an/a 60n/an/an/an/an/a30
University of Athens
Assay Description
Kinase activities were assayed in buffers containing substrate, enzyme, and inhibitor at 30 °C in the presence of 15 uM ATP/ [gamma-32P] ATP. 32...
J Med Chem 47: 935-46 (2004)
Article DOI: 10.1021/jm031016d
BindingDB Entry DOI: 10.7270/Q20G3HB8
Cyclin-Dependent Kinase 1 (CDK1)
(Marthasterias glacialis (starfish))
BDBM7424
((2 Z,3 E)-5,6-Dichloroindirubin-3 -oxime | 5,6-dic...)
Show SMILES Clc1cc2NC(=O)C(c2cc1Cl)c1[nH]c2ccccc2c1N=O
Show InChI InChI=1S/C16H9Cl2N3O2/c17-9-5-8-12(6-10(9)18)20-16(22)13(8)15-14(21-23)7-3-1-2-4-11(7)19-15/h1-6,13,19H,(H,20,22)
n/an/a 140n/an/an/an/an/a30
University of Athens
Assay Description
Kinase activities were assayed in buffers containing substrate, enzyme, and inhibitor at 30 °C in the presence of 15 uM ATP/ [gamma-32P] ATP. 32...
J Med Chem 47: 935-46 (2004)
Article DOI: 10.1021/jm031016d
BindingDB Entry DOI: 10.7270/Q20G3HB8
Glycogen Synthase Kinase-3, beta
(Porcine)
BDBM7424
((2 Z,3 E)-5,6-Dichloroindirubin-3 -oxime | 5,6-dic...)
Show SMILES Clc1cc2NC(=O)C(c2cc1Cl)c1[nH]c2ccccc2c1N=O
Show InChI InChI=1S/C16H9Cl2N3O2/c17-9-5-8-12(6-10(9)18)20-16(22)13(8)15-14(21-23)7-3-1-2-4-11(7)19-15/h1-6,13,19H,(H,20,22)
n/an/a 4n/an/an/an/an/a30
University of Athens
Assay Description
Kinase activities were assayed in buffers containing substrate, enzyme, and inhibitor at 30 °C in the presence of 15 uM ATP/ [gamma-32P] ATP. 32...
J Med Chem 47: 935-46 (2004)
Article DOI: 10.1021/jm031016d
BindingDB Entry DOI: 10.7270/Q20G3HB8