BDBM74286 MLS002180172::N-(6-amino-1-isobutyl-2,4-diketo-pyrimidin-5-yl)-N-butyl-2-cyclohexyl-acetamide::N-[6-amino-1-(2-methylpropyl)-2,4-dioxo-5-pyrimidinyl]-N-butyl-2-cyclohexylacetamide::N-[6-amino-1-(2-methylpropyl)-2,4-dioxopyrimidin-5-yl]-N-butyl-2-cyclohexylacetamide::N-[6-azanyl-1-(2-methylpropyl)-2,4-bis(oxidanylidene)pyrimidin-5-yl]-N-butyl-2-cyclohexyl-ethanamide::SMR001269202::cid_25162059
SMILES: CCCCN(C(=O)CC1CCCCC1)c1c(N)n(CC(C)C)c(=O)[nH]c1=O
InChI Key: InChIKey=TZMOCEWWJHWONB-UHFFFAOYSA-N
Data: 1 EC50
Activity Spreadsheet -- Enzyme Inhibition Constant Data from BindingDB
Found 1 hit for monomerid = 74286
Trg + Lig
Ki
nM
ΔG°
kcal/mole
IC50
nM
Kd
nM
EC50/IC50
nM
koff
s-1
kon
M-1s-1
pHTemp
°C
LANA
(Human herpesvirus 8)
BDBM74286
(MLS002180172 | N-(6-amino-1-isobutyl-2,4-diketo-py...)
Show SMILES CCCCN(C(=O)CC1CCCCC1)c1c(N)n(CC(C)C)c(=O)[nH]c1=O
Show InChI InChI=1S/C20H34N4O3/c1-4-5-11-23(16(25)12-15-9-7-6-8-10-15)17-18(21)24(13-14(2)3)20(27)22-19(17)26/h14-15H,4-13,21H2,1-3H3,(H,22,26,27)
PCBioAssay
n/an/an/an/a>7.50E+4n/an/an/an/a
Broad Institute
Curated by PubChem BioAssay
Assay Description
Primary Collaborators: Kenneth Kaye,Brigham & Womens,Boston MA,kkaye@rics.bwh.harvard.edu,617-525-4256 Chantal Beauchemin,Brigham & Womens,Boston MA,...
PubChem Bioassay (2010)
BindingDB Entry DOI: 10.7270/Q2HH6HHN