BDBM74305 4-[[2-(4-keto-2-pyrrolidino-2-thiazolin-5-yl)acetyl]amino]-N-methyl-benzamide::MLS002182940::N-methyl-4-[2-(4-oxidanylidene-2-pyrrolidin-1-yl-1,3-thiazol-5-yl)ethanoylamino]benzamide::N-methyl-4-[[1-oxo-2-[4-oxo-2-(1-pyrrolidinyl)-5-thiazolyl]ethyl]amino]benzamide::N-methyl-4-[[2-(4-oxo-2-pyrrolidin-1-yl-1,3-thiazol-5-yl)acetyl]amino]benzamide::SMR001271970::cid_18106414
SMILES: CNC(=O)c1ccc(NC(=O)Cc2sc(nc2O)N2CCCC2)cc1
InChI Key: InChIKey=GMKYGWSKCHXILR-UHFFFAOYSA-N
Data: 1 EC50
Activity Spreadsheet -- Enzyme Inhibition Constant Data from BindingDB
Found 1 hit for monomerid = 74305
Trg + Lig
Ki
nM
ΔG°
kcal/mole
IC50
nM
Kd
nM
EC50/IC50
nM
koff
s-1
kon
M-1s-1
pHTemp
°C
LANA
(Human herpesvirus 8)
BDBM74305
(4-[[2-(4-keto-2-pyrrolidino-2-thiazolin-5-yl)acety...)
Show SMILES CNC(=O)c1ccc(NC(=O)Cc2sc(nc2O)N2CCCC2)cc1
Show InChI InChI=1S/C17H20N4O3S/c1-18-15(23)11-4-6-12(7-5-11)19-14(22)10-13-16(24)20-17(25-13)21-8-2-3-9-21/h4-7,24H,2-3,8-10H2,1H3,(H,18,23)(H,19,22)
PCBioAssay
n/an/an/an/a>7.50E+4n/an/an/an/a
Broad Institute
Curated by PubChem BioAssay
Assay Description
Primary Collaborators: Kenneth Kaye,Brigham & Womens,Boston MA,kkaye@rics.bwh.harvard.edu,617-525-4256 Chantal Beauchemin,Brigham & Womens,Boston MA,...
PubChem Bioassay (2010)
BindingDB Entry DOI: 10.7270/Q2HH6HHN