BDBM74320 MLS002161382::N-[2-(2-furanyl)-2-(1-piperidinyl)ethyl]-4-[methyl(phenyl)sulfamoyl]benzamide::N-[2-(2-furyl)-2-piperidino-ethyl]-4-[methyl(phenyl)sulfamoyl]benzamide::N-[2-(furan-2-yl)-2-piperidin-1-yl-ethyl]-4-[methyl(phenyl)sulfamoyl]benzamide::N-[2-(furan-2-yl)-2-piperidin-1-ylethyl]-4-[methyl(phenyl)sulfamoyl]benzamide::SMR001243805::cid_16298001
SMILES: CN(c1ccccc1)S(=O)(=O)c1ccc(cc1)C(=O)NCC(N1CCCCC1)c1ccco1
InChI Key: InChIKey=PJZHRYFOZDRAOR-UHFFFAOYSA-N
Data: 1 EC50
Activity Spreadsheet -- Enzyme Inhibition Constant Data from BindingDB
Found 1 hit for monomerid = 74320
Trg + Lig
Ki
nM
ΔG°
kcal/mole
IC50
nM
Kd
nM
EC50/IC50
nM
koff
s-1
kon
M-1s-1
pHTemp
°C
LANA
(Human herpesvirus 8)
BDBM74320
(MLS002161382 | N-[2-(2-furanyl)-2-(1-piperidinyl)e...)
Show SMILES CN(c1ccccc1)S(=O)(=O)c1ccc(cc1)C(=O)NCC(N1CCCCC1)c1ccco1
Show InChI InChI=1S/C25H29N3O4S/c1-27(21-9-4-2-5-10-21)33(30,31)22-14-12-20(13-15-22)25(29)26-19-23(24-11-8-18-32-24)28-16-6-3-7-17-28/h2,4-5,8-15,18,23H,3,6-7,16-17,19H2,1H3,(H,26,29)
PCBioAssay
n/an/an/an/a>7.50E+4n/an/an/an/a
Broad Institute
Curated by PubChem BioAssay
Assay Description
Primary Collaborators: Kenneth Kaye,Brigham & Womens,Boston MA,kkaye@rics.bwh.harvard.edu,617-525-4256 Chantal Beauchemin,Brigham & Womens,Boston MA,...
PubChem Bioassay (2010)
BindingDB Entry DOI: 10.7270/Q2HH6HHN