BDBM744 (3S)-oxolan-3-yl N-[(2S,3R)-4-[(2S,4R)-2-(tert-butylcarbamoyl)-4-(pyridin-4-ylmethoxy)piperidin-1-yl]-3-hydroxy-1-phenylbutan-2-yl]carbamate::Palinavir deriv. 16
SMILES: CC(C)(C)NC(=O)[C@@H]1C[C@@H](CCN1C[C@@H](O)[C@H](Cc1ccccc1)NC(=O)O[C@H]1CCOC1)OCc1ccncc1
InChI Key: InChIKey=NUYOEBHSJRCFOD-VNGQLYDISA-N
Data: 1 IC50
Activity Spreadsheet -- Enzyme Inhibition Constant Data from BindingDB
Found 1 hit for monomerid = 744
Trg + Lig
Ki
nM
ΔG°
kcal/mole
IC50
nM
Kd
nM
EC50/IC50
nM
koff
s-1
kon
M-1s-1
pHTemp
°C
HIV-1 Protease
(Human immunodeficiency virus type 1)
BDBM744
((3S)-oxolan-3-yl N-[(2S,3R)-4-[(2S,4R)-2-(tert-but...)
Show SMILES CC(C)(C)NC(=O)[C@@H]1C[C@@H](CCN1C[C@@H](O)[C@H](Cc1ccccc1)NC(=O)O[C@H]1CCOC1)OCc1ccncc1 |r|
Show InChI InChI=1S/C31H44N4O6/c1-31(2,3)34-29(37)27-18-24(40-20-23-9-13-32-14-10-23)11-15-35(27)19-28(36)26(17-22-7-5-4-6-8-22)33-30(38)41-25-12-16-39-21-25/h4-10,13-14,24-28,36H,11-12,15-21H2,1-3H3,(H,33,38)(H,34,37)/t24-,25+,26+,27+,28-/m1/s1
n/an/a 260n/an/an/an/a5.537
Boehringer Ingelheim Pharmaceuticals Inc.
Assay Description
Sensitivity of HIV-1 protease activity to protease inhibitors was determined by a peptide substrate cleavage assay. Cleavage products and substrate w...
J Med Chem 43: 1094-108 (2000)
Article DOI: 10.1021/jm990336n
BindingDB Entry DOI: 10.7270/Q2BZ647F