BDBM748 (2S,4R)-N-tert-butyl-1-[(2R,3S)-3-[2-(2,6-dimethylphenoxy)acetamido]-2-hydroxy-4-phenylbutyl]-4-[(2,6-dimethylpyrimidin-4-yl)sulfanyl]piperidine-2-carboxamide::Palinavir deriv. 20
SMILES: Cc1cc(S[C@@H]2CCN(C[C@@H](O)[C@H](Cc3ccccc3)NC(=O)COc3c(C)cccc3C)[C@@H](C2)C(=O)NC(C)(C)C)nc(C)n1
InChI Key: InChIKey=FDYJWNQORWMJFP-QNRWOPMTSA-N
Data: 1 IC50
Activity Spreadsheet -- Enzyme Inhibition Constant Data from BindingDB
Found 1 hit for monomerid = 748
Trg + Lig
Ki
nM
ΔG°
kcal/mole
IC50
nM
Kd
nM
EC50/IC50
nM
koff
s-1
kon
M-1s-1
pHTemp
°C
HIV-1 Protease
(Human immunodeficiency virus type 1)
BDBM748
((2S,4R)-N-tert-butyl-1-[(2R,3S)-3-[2-(2,6-dimethyl...)
Show SMILES Cc1cc(S[C@@H]2CCN(C[C@@H](O)[C@H](Cc3ccccc3)NC(=O)COc3c(C)cccc3C)[C@@H](C2)C(=O)NC(C)(C)C)nc(C)n1 |r|
Show InChI InChI=1S/C36H49N5O4S/c1-23-12-11-13-24(2)34(23)45-22-32(43)39-29(19-27-14-9-8-10-15-27)31(42)21-41-17-16-28(20-30(41)35(44)40-36(5,6)7)46-33-18-25(3)37-26(4)38-33/h8-15,18,28-31,42H,16-17,19-22H2,1-7H3,(H,39,43)(H,40,44)/t28-,29+,30+,31-/m1/s1
n/an/a 1.5n/an/an/an/a5.537
Boehringer Ingelheim Pharmaceuticals Inc.
Assay Description
Sensitivity of HIV-1 protease activity to protease inhibitors was determined by a peptide substrate cleavage assay. Cleavage products and substrate w...
J Med Chem 43: 1094-108 (2000)
Article DOI: 10.1021/jm990336n
BindingDB Entry DOI: 10.7270/Q2BZ647F