BDBM75004 3-(4-ethoxybenzoyl)-7-hydroxy-2H-chromen-2-one::3-(4-ethoxybenzoyl)-7-hydroxy-coumarin::3-(4-ethoxybenzoyl)-7-hydroxychromen-2-one::3-(4-ethoxyphenyl)carbonyl-7-oxidanyl-chromen-2-one::3-[(4-ethoxyphenyl)-oxomethyl]-7-hydroxy-1-benzopyran-2-one::MLS000674754::SMR000314195::cid_16194470
SMILES: CCOc1ccc(cc1)C(=O)c1cc2ccc(O)cc2oc1=O
InChI Key: InChIKey=VGTMSXHVCDAWEC-UHFFFAOYSA-N
Data: 1 EC50
Activity Spreadsheet -- Enzyme Inhibition Constant Data from BindingDB
Found 1 hit for monomerid = 75004
Trg + Lig
Ki
nM
ΔG°
kcal/mole
IC50
nM
Kd
nM
EC50/IC50
nM
koff
s-1
kon
M-1s-1
pHTemp
°C
Importin subunit alpha-1
(Homo sapiens (Human))
BDBM75004
(3-(4-ethoxybenzoyl)-7-hydroxy-2H-chromen-2-one | 3...)
Show SMILES CCOc1ccc(cc1)C(=O)c1cc2ccc(O)cc2oc1=O
Show InChI InChI=1S/C18H14O5/c1-2-22-14-7-4-11(5-8-14)17(20)15-9-12-3-6-13(19)10-16(12)23-18(15)21/h3-10,19H,2H2,1H3
Reactome pathway
PCBioAssay
n/an/an/an/a 7.96E+3n/an/an/an/a
Broad Institute
Curated by PubChem BioAssay
Assay Description
Keywords: Counterscreen, FRET assay, HTS, YIC probe, Dose response, Assay Overview: This is a fluorescence resonance energy transfer (FRET)-based b...
PubChem Bioassay (2010)
BindingDB Entry DOI: 10.7270/Q280513R