BDBM75005 3-(2-methoxyphenyl)carbonyl-7-oxidanyl-chromen-2-one::7-hydroxy-3-(2-methoxybenzoyl)-2H-chromen-2-one::7-hydroxy-3-(2-methoxybenzoyl)chromen-2-one::7-hydroxy-3-[(2-methoxyphenyl)-oxomethyl]-1-benzopyran-2-one::7-hydroxy-3-o-anisoyl-coumarin::MLS000674755::SMR000314196::cid_16194490
SMILES: COc1ccccc1C(=O)c1cc2ccc(O)cc2oc1=O
InChI Key: InChIKey=AMIOQZWVLXCHSB-UHFFFAOYSA-N
Data: 1 EC50
Activity Spreadsheet -- Enzyme Inhibition Constant Data from BindingDB
Found 1 hit for monomerid = 75005
Trg + Lig
Ki
nM
ΔG°
kcal/mole
IC50
nM
Kd
nM
EC50/IC50
nM
koff
s-1
kon
M-1s-1
pHTemp
°C
karyopherin alpha 2 (RAG cohort 1, importin alpha 1), isoform CRA_b
(Homo sapiens (Human))
BDBM75005
(3-(2-methoxyphenyl)carbonyl-7-oxidanyl-chromen-2-o...)
Show SMILES COc1ccccc1C(=O)c1cc2ccc(O)cc2oc1=O
Show InChI InChI=1S/C17H12O5/c1-21-14-5-3-2-4-12(14)16(19)13-8-10-6-7-11(18)9-15(10)22-17(13)20/h2-9,18H,1H3
Reactome pathway
PCBioAssay
n/an/an/an/a 7.12E+3n/an/an/an/a
Broad Institute
Curated by PubChem BioAssay
Assay Description
Keywords: Counterscreen, FRET assay, HTS, YIC probe, Dose response, Assay Overview: This is a fluorescence resonance energy transfer (FRET)-based b...
PubChem Bioassay (2010)
BindingDB Entry DOI: 10.7270/Q280513R