BDBM75017 (2,4-dichlorophenyl)-[1-methyl-5-(methyloximinomethyl)pyrrol-3-yl]methanone::(2,4-dichlorophenyl)-[5-(methoxyiminomethyl)-1-methyl-3-pyrrolyl]methanone::(2,4-dichlorophenyl)-[5-(methoxyiminomethyl)-1-methyl-pyrrol-3-yl]methanone::(2,4-dichlorophenyl)-[5-(methoxyiminomethyl)-1-methylpyrrol-3-yl]methanone::4-(2,4-dichlorobenzoyl)-1-methyl-1H-pyrrole-2-carbaldehyde O-methyloxime::MLS000692119::SMR000333791::cid_3737203
SMILES: CON=Cc1cc(cn1C)C(=O)c1ccc(Cl)cc1Cl
InChI Key: InChIKey=KNABZFDFZZRLPK-UHFFFAOYSA-N
Data: 1 EC50
Activity Spreadsheet -- Enzyme Inhibition Constant Data from BindingDB
Found 1 hit for monomerid = 75017
Trg + Lig
Ki
nM
ΔG°
kcal/mole
IC50
nM
Kd
nM
EC50/IC50
nM
koff
s-1
kon
M-1s-1
pHTemp
°C
Importin subunit alpha-1
(Homo sapiens (Human))
BDBM75017
((2,4-dichlorophenyl)-[1-methyl-5-(methyloximinomet...)
Show SMILES CON=Cc1cc(cn1C)C(=O)c1ccc(Cl)cc1Cl
Show InChI InChI=1S/C14H12Cl2N2O2/c1-18-8-9(5-11(18)7-17-20-2)14(19)12-4-3-10(15)6-13(12)16/h3-8H,1-2H3
Reactome pathway
PCBioAssay
n/an/an/an/a>5.00E+5n/an/an/an/a
Broad Institute
Curated by PubChem BioAssay
Assay Description
Keywords: Counterscreen, FRET assay, HTS, YIC probe, Dose response, Assay Overview: This is a fluorescence resonance energy transfer (FRET)-based b...
PubChem Bioassay (2010)
BindingDB Entry DOI: 10.7270/Q280513R