null
SMILES: CCOC(=O)C(=O)Nc1cc(cc(c1)C(=O)OC)C(=O)OC
InChI Key: InChIKey=TWDSJCZGISSVAI-UHFFFAOYSA-N
Activity Spreadsheet -- Enzyme Inhibition Constant Data from BindingDB
Found 1 hit for monomerid = 75022
Trg + Lig
Ki
nM
ΔG°
kcal/mole
IC50
nM
Kd
nM
EC50/IC50
nM
koff
s-1
kon
M-1s-1
pHTemp
°C
Importin subunit alpha-1
(Homo sapiens (Human))
BDBM75022
(5-(ethoxalylamino)benzene-1,3-dicarboxylic acid di...)
Show SMILES CCOC(=O)C(=O)Nc1cc(cc(c1)C(=O)OC)C(=O)OC
Show InChI InChI=1S/C14H15NO7/c1-4-22-14(19)11(16)15-10-6-8(12(17)20-2)5-9(7-10)13(18)21-3/h5-7H,4H2,1-3H3,(H,15,16)
Reactome pathway
PCBioAssay
n/an/an/an/a>5.00E+5n/an/an/an/a
Broad Institute
Curated by PubChem BioAssay
Assay Description
Keywords: Counterscreen, FRET assay, HTS, YIC probe, Dose response, Assay Overview: This is a fluorescence resonance energy transfer (FRET)-based b...
PubChem Bioassay (2010)
BindingDB Entry DOI: 10.7270/Q280513R