BDBM75070 5-keto-2-nicotinoylimino-1-propyl-dipyrido[1,2-d:3',4'-f]pyrimidine-3-carboxylic acid ethyl ester::5-oxo-2-[oxo(3-pyridinyl)methyl]imino-1-propyl-3-dipyrido[1,2-d:3',4'-f]pyrimidinecarboxylic acid ethyl ester::MLS000879013::SMR000022064::cid_2155909::ethyl (2E)-5-oxo-1-propyl-2-[(pyridin-3-ylcarbonyl)imino]-1,5-dihydro-2H-dipyrido[1,2-a:2',3'-d]pyrimidine-3-carboxylate::ethyl 5-oxidanylidene-1-propyl-2-pyridin-3-ylcarbonylimino-dipyrido[1,2-d:3',4'-f]pyrimidine-3-carboxylate::ethyl 5-oxo-1-propyl-2-(pyridine-3-carbonylimino)dipyrido[1,2-d:3',4'-f]pyrimidine-3-carboxylate
SMILES: CCCn1c2nc3ccccn3c(=O)c2cc(C(=O)OCC)\c1=N/C(=O)c1cccnc1
InChI Key: InChIKey=NVUYZWVSOBOUGG-LHLOQNFPSA-N
Data: 1 EC50
Activity Spreadsheet -- Enzyme Inhibition Constant Data from BindingDB
Found 1 hit for monomerid = 75070
Trg + Lig
Ki
nM
ΔG°
kcal/mole
IC50
nM
Kd
nM
EC50/IC50
nM
koff
s-1
kon
M-1s-1
pHTemp
°C
karyopherin alpha 2 (RAG cohort 1, importin alpha 1), isoform CRA_b
(Homo sapiens (Human))
BDBM75070
(5-keto-2-nicotinoylimino-1-propyl-dipyrido[1,2-d:3...)
Show SMILES CCCn1c2nc3ccccn3c(=O)c2cc(C(=O)OCC)\c1=N/C(=O)c1cccnc1
Show InChI InChI=1S/C23H21N5O4/c1-3-11-28-19-16(22(30)27-12-6-5-9-18(27)25-19)13-17(23(31)32-4-2)20(28)26-21(29)15-8-7-10-24-14-15/h5-10,12-14H,3-4,11H2,1-2H3/b26-20+
Reactome pathway
PCBioAssay
n/an/an/an/a 4.18E+3n/an/an/an/a
Broad Institute
Curated by PubChem BioAssay
Assay Description
Keywords: Counterscreen, FRET assay, HTS, YIC probe, Dose response, Assay Overview: This is a fluorescence resonance energy transfer (FRET)-based b...
PubChem Bioassay (2010)
BindingDB Entry DOI: 10.7270/Q280513R