null
SMILES: NNc1nc2sc3CN(Cc4ccccc4)CCc3c2c(=O)n1C1CCCCC1
InChI Key: InChIKey=HQMCIFZYDJVKRK-UHFFFAOYSA-N
Activity Spreadsheet -- Enzyme Inhibition Constant Data from BindingDB
Found 1 hit for monomerid = 75083
Trg + Lig
Ki
nM
ΔG°
kcal/mole
IC50
nM
Kd
nM
EC50/IC50
nM
koff
s-1
kon
M-1s-1
pHTemp
°C
Importin subunit alpha-1
(Homo sapiens (Human))
BDBM75083
(3-cyclohexyl-2-diazanyl-7-(phenylmethyl)-6,8-dihyd...)
Show SMILES NNc1nc2sc3CN(Cc4ccccc4)CCc3c2c(=O)n1C1CCCCC1
Show InChI InChI=1S/C22H27N5OS/c23-25-22-24-20-19(21(28)27(22)16-9-5-2-6-10-16)17-11-12-26(14-18(17)29-20)13-15-7-3-1-4-8-15/h1,3-4,7-8,16H,2,5-6,9-14,23H2,(H,24,25)
Reactome pathway
PCBioAssay
n/an/an/an/a 918n/an/an/an/a
Broad Institute
Curated by PubChem BioAssay
Assay Description
Keywords: Counterscreen, FRET assay, HTS, YIC probe, Dose response, Assay Overview: This is a fluorescence resonance energy transfer (FRET)-based b...
PubChem Bioassay (2010)
BindingDB Entry DOI: 10.7270/Q280513R