null
SMILES: COC(=O)c1cc(=O)n2c(sc3ccccc23)c1C#N
InChI Key: InChIKey=SRXVPGTUSFNTOF-UHFFFAOYSA-N
Activity Spreadsheet -- Enzyme Inhibition Constant Data from BindingDB
Found 1 hit for monomerid = 75116
Trg + Lig
Ki
nM
ΔG°
kcal/mole
IC50
nM
Kd
nM
EC50/IC50
nM
koff
s-1
kon
M-1s-1
pHTemp
°C
Importin subunit alpha-1
(Homo sapiens (Human))
BDBM75116
(4-cyano-1-keto-pyrido[2,1-b][1,3]benzothiazole-3-c...)
Show SMILES COC(=O)c1cc(=O)n2c(sc3ccccc23)c1C#N
Show InChI InChI=1S/C14H8N2O3S/c1-19-14(18)8-6-12(17)16-10-4-2-3-5-11(10)20-13(16)9(8)7-15/h2-6H,1H3
Reactome pathway
PCBioAssay
n/an/an/an/a 4.11E+3n/an/an/an/a
Broad Institute
Curated by PubChem BioAssay
Assay Description
Keywords: Counterscreen, FRET assay, HTS, YIC probe, Dose response, Assay Overview: This is a fluorescence resonance energy transfer (FRET)-based b...
PubChem Bioassay (2010)
BindingDB Entry DOI: 10.7270/Q280513R