BDBM7527 1-[6-(benzylamino)-9-(propan-2-yl)-9H-purin-2-yl]pyrrolidin-3-ol::2,6,9-Trisubstituted purine deriv. 22::CHEMBL335966
SMILES: CC(C)n1cnc2c(NCc3ccccc3)nc(nc12)N1CCC(O)C1
InChI Key: InChIKey=QAZLAITVCWIMJF-UHFFFAOYSA-N
Data: 4 IC50
PDB links: 4 PDB IDs contain inhibitors having a similarity of 90% to this monomer.
Activity Spreadsheet -- Enzyme Inhibition Constant Data from BindingDB
Found 4 hits for monomerid = 7527
Trg + Lig
Ki
nM
ΔG°
kcal/mole
IC50
nM
Kd
nM
EC50/IC50
nM
koff
s-1
kon
M-1s-1
pHTemp
°C
Cyclin-Dependent Kinase 1 (CDK1)
(Marthasterias glacialis (starfish))
BDBM7527
(1-[6-(benzylamino)-9-(propan-2-yl)-9H-purin-2-yl]p...)
Show SMILES CC(C)n1cnc2c(NCc3ccccc3)nc(nc12)N1CCC(O)C1
Show InChI InChI=1S/C19H24N6O/c1-13(2)25-12-21-16-17(20-10-14-6-4-3-5-7-14)22-19(23-18(16)25)24-9-8-15(26)11-24/h3-7,12-13,15,26H,8-11H2,1-2H3,(H,20,22,23)
n/an/a 4.20E+4n/an/an/an/an/a30
Institut Curie
Assay Description
Kinase activities were assayed in buffers containing substrate, enzyme, and inhibitor at 30 °C in the presence of 15 uM ATP/ [gamma-32P] ATP. 32...
Bioorg Med Chem 7: 1281-93 (1999)
Article DOI: 10.1016/S0968-0896(99)00064-4
BindingDB Entry DOI: 10.7270/Q23776X6
Cyclin-dependent-like kinase 5
(Homo sapiens (Human))
BDBM7527
(1-[6-(benzylamino)-9-(propan-2-yl)-9H-purin-2-yl]p...)
Show SMILES CC(C)n1cnc2c(NCc3ccccc3)nc(nc12)N1CCC(O)C1
Show InChI InChI=1S/C19H24N6O/c1-13(2)25-12-21-16-17(20-10-14-6-4-3-5-7-14)22-19(23-18(16)25)24-9-8-15(26)11-24/h3-7,12-13,15,26H,8-11H2,1-2H3,(H,20,22,23)
NCI pathway
Reactome pathway
n/an/a 2.40E+3n/an/an/an/an/an/a
Institut Curie
Curated by ChEMBL
Assay Description
Compound was tested for its inhibitory activity against cyclin-dependent kinase 5
J Med Chem 43: 4098-108 (2000)
BindingDB Entry DOI: 10.7270/Q24B321Q
Cyclin-dependent kinase 1
(Homo sapiens (Human))
BDBM7527
(1-[6-(benzylamino)-9-(propan-2-yl)-9H-purin-2-yl]p...)
Show SMILES CC(C)n1cnc2c(NCc3ccccc3)nc(nc12)N1CCC(O)C1
Show InChI InChI=1S/C19H24N6O/c1-13(2)25-12-21-16-17(20-10-14-6-4-3-5-7-14)22-19(23-18(16)25)24-9-8-15(26)11-24/h3-7,12-13,15,26H,8-11H2,1-2H3,(H,20,22,23)
Reactome pathway
n/an/a 4.20E+4n/an/an/an/an/an/a
Institut Curie
Curated by ChEMBL
Assay Description
Inhibition of Cyclin-dependent kinase 1 (CDK1)
J Med Chem 43: 4098-108 (2000)
BindingDB Entry DOI: 10.7270/Q24B321Q
Cyclin-Dependent Kinase 5 (CDK5)
(Homo sapiens (Human))
BDBM7527
(1-[6-(benzylamino)-9-(propan-2-yl)-9H-purin-2-yl]p...)
Show SMILES CC(C)n1cnc2c(NCc3ccccc3)nc(nc12)N1CCC(O)C1
Show InChI InChI=1S/C19H24N6O/c1-13(2)25-12-21-16-17(20-10-14-6-4-3-5-7-14)22-19(23-18(16)25)24-9-8-15(26)11-24/h3-7,12-13,15,26H,8-11H2,1-2H3,(H,20,22,23)
NCI pathway
Reactome pathway
n/an/a 2.40E+3n/an/an/an/an/a30
Institut Curie
Assay Description
Kinase activities were assayed in buffers containing substrate, enzyme, and inhibitor at 30 °C in the presence of 15 uM ATP/ [gamma-32P] ATP. 32...
Bioorg Med Chem 7: 1281-93 (1999)
Article DOI: 10.1016/S0968-0896(99)00064-4
BindingDB Entry DOI: 10.7270/Q23776X6