BDBM7573 1-(6-{[(4-methoxyphenyl)methyl]amino}-9-(propan-2-yl)-9H-purin-2-yl)-3-methylpent-1-yn-3-ol::1-{9-isopropyl-6-[(4-methoxybenzyl)amino]-9H-purin-2-yl}-3-methylpent-1-yn-3-ol::2-purine deriv. 3b::C-2 alkynylated purine deriv. 4b::CHEMBL422759::OL567
SMILES: CCC(C)(O)C#Cc1nc(NCc2ccc(OC)cc2)c2ncn(C(C)C)c2n1
InChI Key: InChIKey=ATFBEKGTULYWDD-UHFFFAOYSA-N
Data: 4 IC50
Activity Spreadsheet -- Enzyme Inhibition Constant Data from BindingDB
Found 4 hits for monomerid = 7573
Trg + Lig
Ki
nM
ΔG°
kcal/mole
IC50
nM
Kd
nM
EC50/IC50
nM
koff
s-1
kon
M-1s-1
pHTemp
°C
Cyclin-Dependent Kinase 1 (CDK1)
(Marthasterias glacialis (starfish))
BDBM7573
(1-(6-{[(4-methoxyphenyl)methyl]amino}-9-(propan-2-...)
Show SMILES CCC(C)(O)C#Cc1nc(NCc2ccc(OC)cc2)c2ncn(C(C)C)c2n1
Show InChI InChI=1S/C22H27N5O2/c1-6-22(4,28)12-11-18-25-20(19-21(26-18)27(14-24-19)15(2)3)23-13-16-7-9-17(29-5)10-8-16/h7-10,14-15,28H,6,13H2,1-5H3,(H,23,25,26)
n/an/a 230n/an/an/an/a7.230
Institut Curie
Assay Description
Kinase activities were assayed in buffers containing substrate, enzyme, and inhibitor at 30 °C in the presence of 15 uM ATP/ [gamma-32P] ATP. 32...
J Med Chem 43: 1282-92 (2000)
Article DOI: 10.1021/jm9911130
BindingDB Entry DOI: 10.7270/Q2K935R2
Cyclin-dependent-like kinase 5
(Homo sapiens (Human))
BDBM7573
(1-(6-{[(4-methoxyphenyl)methyl]amino}-9-(propan-2-...)
Show SMILES CCC(C)(O)C#Cc1nc(NCc2ccc(OC)cc2)c2ncn(C(C)C)c2n1
Show InChI InChI=1S/C22H27N5O2/c1-6-22(4,28)12-11-18-25-20(19-21(26-18)27(14-24-19)15(2)3)23-13-16-7-9-17(29-5)10-8-16/h7-10,14-15,28H,6,13H2,1-5H3,(H,23,25,26)
NCI pathway
Reactome pathway
n/an/a 400n/an/an/an/an/an/a
Institut Curie
Curated by ChEMBL
Assay Description
Compound was tested for its inhibitory activity against cyclin-dependent kinase 5
J Med Chem 43: 4098-108 (2000)
BindingDB Entry DOI: 10.7270/Q24B321Q
Cyclin-dependent kinase 1
(Homo sapiens (Human))
BDBM7573
(1-(6-{[(4-methoxyphenyl)methyl]amino}-9-(propan-2-...)
Show SMILES CCC(C)(O)C#Cc1nc(NCc2ccc(OC)cc2)c2ncn(C(C)C)c2n1
Show InChI InChI=1S/C22H27N5O2/c1-6-22(4,28)12-11-18-25-20(19-21(26-18)27(14-24-19)15(2)3)23-13-16-7-9-17(29-5)10-8-16/h7-10,14-15,28H,6,13H2,1-5H3,(H,23,25,26)
Reactome pathway
n/an/a 230n/an/an/an/an/an/a
Institut Curie
Curated by ChEMBL
Assay Description
Inhibition of cyclin-dependent kinase 1
J Med Chem 43: 4098-108 (2000)
BindingDB Entry DOI: 10.7270/Q24B321Q
Cyclin-Dependent Kinase 1 (CDK1)
(Marthasterias glacialis (starfish))
BDBM7573
(1-(6-{[(4-methoxyphenyl)methyl]amino}-9-(propan-2-...)
Show SMILES CCC(C)(O)C#Cc1nc(NCc2ccc(OC)cc2)c2ncn(C(C)C)c2n1
Show InChI InChI=1S/C22H27N5O2/c1-6-22(4,28)12-11-18-25-20(19-21(26-18)27(14-24-19)15(2)3)23-13-16-7-9-17(29-5)10-8-16/h7-10,14-15,28H,6,13H2,1-5H3,(H,23,25,26)
n/an/a 230n/an/an/an/a7.230
Institut Curie
Assay Description
Kinase activities were assayed in buffers containing substrate, enzyme, and inhibitor at 30 °C in the presence of 15 uM ATP/[gamma-32P] ATP. 32P...
Bioorg Med Chem Lett 16: 3144-6 (2006)
Article DOI: 10.1016/j.bmcl.2006.03.060
BindingDB Entry DOI: 10.7270/Q2862DPV