BDBM75992 6-chloranyl-N-[3-([1,3]thiazolo[5,4-b]pyridin-2-yl)phenyl]pyridine-3-carboxamide::6-chloro-N-(3-thiazolo[5,4-b]pyridin-2-ylphenyl)nicotinamide::6-chloro-N-[3-(2-thiazolo[5,4-b]pyridinyl)phenyl]-3-pyridinecarboxamide::6-chloro-N-[3-([1,3]thiazolo[5,4-b]pyridin-2-yl)phenyl]pyridine-3-carboxamide::MLS000419377::SMR000320130::cid_7087638
SMILES: Clc1ccc(cn1)C(=O)Nc1cccc(c1)-c1nc2cccnc2s1
InChI Key: InChIKey=MRZYERGMRBGJFM-UHFFFAOYSA-N
Data: 2 IC50
Activity Spreadsheet -- Enzyme Inhibition Constant Data from BindingDB
Found 2 hits for monomerid = 75992
Trg + Lig
Ki
nM
ΔG°
kcal/mole
IC50
nM
Kd
nM
EC50/IC50
nM
koff
s-1
kon
M-1s-1
pHTemp
°C
Photoreceptor-specific nuclear receptor
(Homo sapiens (Human))
BDBM75992
(6-chloranyl-N-[3-([1,3]thiazolo[5,4-b]pyridin-2-yl...)
Show SMILES Clc1ccc(cn1)C(=O)Nc1cccc(c1)-c1nc2cccnc2s1
Show InChI InChI=1S/C18H11ClN4OS/c19-15-7-6-12(10-21-15)16(24)22-13-4-1-3-11(9-13)17-23-14-5-2-8-20-18(14)25-17/h1-10H,(H,22,24)
Reactome pathway
PCBioAssay
n/an/a 3.37E+3n/an/an/an/an/an/a
The Scripps Research Institute Molecular Screening Center
Curated by PubChem BioAssay
Assay Description
Source (MLPCN Center Name): The Scripps Research Institute Molecular Screening Center Affiliation: The Scripps Research Institute, TSRI Assay Provide...
PubChem Bioassay (2010)
BindingDB Entry DOI: 10.7270/Q2BK19S0
Nuclear receptor corepressor 2 (TRAC-1)
(Homo sapiens (Human))
BDBM75992
(6-chloranyl-N-[3-([1,3]thiazolo[5,4-b]pyridin-2-yl...)
Show SMILES Clc1ccc(cn1)C(=O)Nc1cccc(c1)-c1nc2cccnc2s1
Show InChI InChI=1S/C18H11ClN4OS/c19-15-7-6-12(10-21-15)16(24)22-13-4-1-3-11(9-13)17-23-14-5-2-8-20-18(14)25-17/h1-10H,(H,22,24)
PCBioAssay
n/an/a 1.80E+3n/an/an/an/an/an/a
The Scripps Research Institute Molecular Screening Center
Curated by PubChem BioAssay
Assay Description
Source (MLPCN Center Name): The Scripps Research Institute Molecular Screening Center Affiliation: The Scripps Research Institute, TSRI Assay Provide...
PubChem Bioassay (2010)
BindingDB Entry DOI: 10.7270/Q26T0K34