BDBM76125 (3-butyl-7-methyl-6,8-dioxoisochromen-7-yl) cyclopentanecarboxylate::CMLD003384::MLS000438302::SMR000452562::[3-butyl-7-methyl-6,8-bis(oxidanylidene)isochromen-7-yl] cyclopentanecarboxylate::cid_16745542::cyclopentanecarboxylic acid (3-butyl-6,8-diketo-7-methyl-isochromen-7-yl) ester::cyclopentanecarboxylic acid (3-butyl-7-methyl-6,8-dioxo-2-benzopyran-7-yl) ester
SMILES: CCCCC1=CC2=CC(=O)C(C)(OC(=O)C3CCCC3)C(=O)C2=CO1
InChI Key: InChIKey=DFLRUMRQZKFKRX-UHFFFAOYSA-N
Data: 2 IC50  2 EC50
Activity Spreadsheet -- Enzyme Inhibition Constant Data from BindingDB
Found 4 hits for monomerid = 76125
Trg + Lig
Ki
nM
ΔG°
kcal/mole
IC50
nM
Kd
nM
EC50/IC50
nM
koff
s-1
kon
M-1s-1
pHTemp
°C
Angiotensin II receptor
(Homo sapiens (Human))
BDBM76125
((3-butyl-7-methyl-6,8-dioxoisochromen-7-yl) cyclop...)
Show SMILES CCCCC1=CC2=CC(=O)C(C)(OC(=O)C3CCCC3)C(=O)C2=CO1 |c:24,t:4,6|
Show InChI InChI=1S/C20H24O5/c1-3-4-9-15-10-14-11-17(21)20(2,18(22)16(14)12-24-15)25-19(23)13-7-5-6-8-13/h10-13H,3-9H2,1-2H3
Reactome pathway
PCBioAssay
n/an/an/an/a>1.00E+5n/an/an/an/a
Burnham Center for Chemical Genomics
Curated by PubChem BioAssay
Assay Description
Data Source: Sanford-Burnham Center for Chemical Genomics (SBCCG) Source Affiliation: Sanford-Burnham Medical Research Institute(SBMRI, San Diego) Ne...
PubChem Bioassay (2010)
BindingDB Entry DOI: 10.7270/Q2PR7TFT
26S Proteasome regulatory subunit Rpn11 (Rpn11)
(Homo sapiens (Human))
BDBM76125
((3-butyl-7-methyl-6,8-dioxoisochromen-7-yl) cyclop...)
Show SMILES CCCCC1=CC2=CC(=O)C(C)(OC(=O)C3CCCC3)C(=O)C2=CO1 |c:24,t:4,6|
Show InChI InChI=1S/C20H24O5/c1-3-4-9-15-10-14-11-17(21)20(2,18(22)16(14)12-24-15)25-19(23)13-7-5-6-8-13/h10-13H,3-9H2,1-2H3
PCBioAssay
n/an/a 7.64E+3n/an/an/an/an/an/a
Burnham Center for Chemical Genomics
Curated by PubChem BioAssay
Assay Description
Data Source: Sanford-Burnham Center for Chemical Genomics (SBCCG) Source Affiliation: Sanford Burnham Medical Research Institute (SBMRI, La Jolla, CA...
PubChem Bioassay (2012)
BindingDB Entry DOI: 10.7270/Q2PC30Z9
Thrombin
(Bos taurus (Bovine))
BDBM76125
((3-butyl-7-methyl-6,8-dioxoisochromen-7-yl) cyclop...)
Show SMILES CCCCC1=CC2=CC(=O)C(C)(OC(=O)C3CCCC3)C(=O)C2=CO1 |c:24,t:4,6|
Show InChI InChI=1S/C20H24O5/c1-3-4-9-15-10-14-11-17(21)20(2,18(22)16(14)12-24-15)25-19(23)13-7-5-6-8-13/h10-13H,3-9H2,1-2H3
PCBioAssay
n/an/a 7.84E+3n/an/an/an/an/an/a
Burnham Center for Chemical Genomics
Curated by PubChem BioAssay
Assay Description
Data Source: Sanford-Burnham Center for Chemical Genomics (SBCCG) Source Affiliation: Sanford Burnham Medical Research Institute (SBMRI, La Jolla, CA...
PubChem Bioassay (2012)
BindingDB Entry DOI: 10.7270/Q2JM286J
Apelin receptor
(Homo sapiens (Human))
BDBM76125
((3-butyl-7-methyl-6,8-dioxoisochromen-7-yl) cyclop...)
Show SMILES CCCCC1=CC2=CC(=O)C(C)(OC(=O)C3CCCC3)C(=O)C2=CO1 |c:24,t:4,6|
Show InChI InChI=1S/C20H24O5/c1-3-4-9-15-10-14-11-17(21)20(2,18(22)16(14)12-24-15)25-19(23)13-7-5-6-8-13/h10-13H,3-9H2,1-2H3
Reactome pathway
PCBioAssay
n/an/an/an/a>1.00E+5n/an/an/an/a
Burnham Center for Chemical Genomics
Curated by PubChem BioAssay
Assay Description
Data Source: Sanford-Burnham Center for Chemical Genomics (SBCCG) Source Affiliation: Sanford-Burnham Medical Research Institute(SBMRI, San Diego) Ne...
PubChem Bioassay (2010)
BindingDB Entry DOI: 10.7270/Q2NV9GP9