BDBM762 BocPhe[CHOH(CH2)3CH=CHPhCO]IleAMBI::L-687,908::tert-butyl N-[(2S,3S,5R)-5-({1-[(1H-1,3-benzodiazol-2-ylmethyl)carbamoyl]-2-methylbutyl}carbamoyl)-3-hydroxy-1-phenyl-5-[(2E)-3-phenylprop-2-en-1-yl]pentan-2-yl]carbamate
SMILES: CCC(C)C(NC(=O)[C@H](C\C=C\c1ccccc1)C[C@H](O)[C@H](Cc1ccccc1)NC(=O)OC(C)(C)C)C(=O)NCc1nc2ccccc2[nH]1
InChI Key: InChIKey=XETIIHXJGVJJAT-NODMNJIGSA-N
Data: 1 IC50
Activity Spreadsheet -- Enzyme Inhibition Constant Data from BindingDB
Found 1 hit for monomerid = 762
Trg + Lig
Ki
nM
ΔG°
kcal/mole
IC50
nM
Kd
nM
EC50/IC50
nM
koff
s-1
kon
M-1s-1
pHTemp
°C
HIV-1 Protease
(Human immunodeficiency virus type 1)
BDBM762
(BocPhe[CHOH(CH2)3CH=CHPhCO]IleAMBI | L-687,908 | t...)
Show SMILES CCC(C)C(NC(=O)[C@H](C\C=C\c1ccccc1)C[C@H](O)[C@H](Cc1ccccc1)NC(=O)OC(C)(C)C)C(=O)NCc1nc2ccccc2[nH]1 |r|
Show InChI InChI=1S/C40H51N5O5/c1-6-27(2)36(38(48)41-26-35-42-31-22-13-14-23-32(31)43-35)45-37(47)30(21-15-20-28-16-9-7-10-17-28)25-34(46)33(24-29-18-11-8-12-19-29)44-39(49)50-40(3,4)5/h7-20,22-23,27,30,33-34,36,46H,6,21,24-26H2,1-5H3,(H,41,48)(H,42,43)(H,44,49)(H,45,47)/b20-15+/t27?,30-,33+,34+,36?/m1/s1
n/an/a 0.0300n/an/an/an/a5.530
Merck Research Laboratories
Assay Description
Sensitivity of HIV-1 protease activity to protease inhibitors was determined by a peptide substrate cleavage assay. Protease products were analyzed o...
J Med Chem 34: 1225-8 (1991)
Article DOI: 10.1021/jm00107a050
BindingDB Entry DOI: 10.7270/Q2765CH1