BDBM76258 VU0419499-1::cid_3242032::dimethyl spiro[1,3-dioxolane-2,9'-fluorene]-4,5-dicarboxylate::spiro[1,3-dioxolane-2,9'-fluorene]-4,5-dicarboxylic acid dimethyl ester
SMILES: COC(=O)C1OC2(OC1C(=O)OC)c1ccccc1-c1ccccc21
InChI Key: InChIKey=ZMWYEJCWZYKYJY-UHFFFAOYSA-N
Data: 1 EC50
Activity Spreadsheet -- Enzyme Inhibition Constant Data from BindingDB
Found 1 hit for monomerid = 76258
Trg + Lig
Ki
nM
ΔG°
kcal/mole
IC50
nM
Kd
nM
EC50/IC50
nM
koff
s-1
kon
M-1s-1
pHTemp
°C
Integrin alpha-4
(Homo sapiens (Human))
BDBM76258
(VU0419499-1 | cid_3242032 | dimethyl spiro[1,3-dio...)
Show SMILES COC(=O)C1OC2(OC1C(=O)OC)c1ccccc1-c1ccccc21
Show InChI InChI=1S/C19H16O6/c1-22-17(20)15-16(18(21)23-2)25-19(24-15)13-9-5-3-7-11(13)12-8-4-6-10-14(12)19/h3-10,15-16H,1-2H3
PCBioAssay
n/an/an/an/a 7.14E+3n/an/an/an/a
NMMLSC
Curated by PubChem BioAssay
Assay Description
University of New Mexico Assay Overview: Assay Support: 1 R01 HL081062-01 Project Title: HTS for Identification of VLA-4 Allosteric Modulators (ML...
PubChem Bioassay (2010)
BindingDB Entry DOI: 10.7270/Q24X5684