BDBM7661 N-[2-(dimethylamino)ethyl]-4-[(4-{imidazo[1,2-a]pyridin-3-yl}pyrimidin-2-yl)amino]benzene-1-sulfonamide::sulfonamide deriv. 3d
SMILES: CN(C)CCNS(=O)(=O)c1ccc(Nc2nccc(n2)-c2cnc3ccccn23)cc1
InChI Key: InChIKey=HYBCPKCAHCAFSQ-UHFFFAOYSA-N
Data: 2 IC50
PDB links: 1 PDB ID contains inhibitors having a similarity of 90% to this monomer.
Activity Spreadsheet -- Enzyme Inhibition Constant Data from BindingDB
Found 2 hits for monomerid = 7661
Trg + Lig
Ki
nM
ΔG°
kcal/mole
IC50
nM
Kd
nM
EC50/IC50
nM
koff
s-1
kon
M-1s-1
pHTemp
°C
Cyclin-Dependent Kinase 4 (CDK4)
(Homo sapiens (Human))
BDBM7661
(N-[2-(dimethylamino)ethyl]-4-[(4-{imidazo[1,2-a]py...)
Show SMILES CN(C)CCNS(=O)(=O)c1ccc(Nc2nccc(n2)-c2cnc3ccccn23)cc1
Show InChI InChI=1S/C21H23N7O2S/c1-27(2)14-12-24-31(29,30)17-8-6-16(7-9-17)25-21-22-11-10-18(26-21)19-15-23-20-5-3-4-13-28(19)20/h3-11,13,15,24H,12,14H2,1-2H3,(H,22,25,26)
NCI pathway
Reactome pathway
n/an/a 260n/an/an/an/a7.022
AstraZeneca
Assay Description
The kinase activity was assayed using an in vitro scintillation proximity assay (SPA) for measuring incorporation of [gamma-33P] ATP into GST-Rb.
Bioorg Med Chem Lett 14: 2245-8 (2004)
Article DOI: 10.1016/j.bmcl.2004.02.015
BindingDB Entry DOI: 10.7270/Q22805TT
CDK2/CycE
(Homo sapiens (Human))
BDBM7661
(N-[2-(dimethylamino)ethyl]-4-[(4-{imidazo[1,2-a]py...)
Show SMILES CN(C)CCNS(=O)(=O)c1ccc(Nc2nccc(n2)-c2cnc3ccccn23)cc1
Show InChI InChI=1S/C21H23N7O2S/c1-27(2)14-12-24-31(29,30)17-8-6-16(7-9-17)25-21-22-11-10-18(26-21)19-15-23-20-5-3-4-13-28(19)20/h3-11,13,15,24H,12,14H2,1-2H3,(H,22,25,26)
n/an/a 5n/an/an/an/a7.022
AstraZeneca
Assay Description
The kinase activity was assayed using an in vitro scintillation proximity assay (SPA) for measuring incorporation of [gamma-33P] ATP into GST-Rb.
Bioorg Med Chem Lett 14: 2245-8 (2004)
Article DOI: 10.1016/j.bmcl.2004.02.015
BindingDB Entry DOI: 10.7270/Q22805TT