BDBM76669 3,4-dimethoxy-N-(2-naphthalenyl)benzamide::3,4-dimethoxy-N-(2-naphthyl)benzamide::3,4-dimethoxy-N-naphthalen-2-yl-benzamide::3,4-dimethoxy-N-naphthalen-2-ylbenzamide::MLS001211936::SMR000518386::cid_784729
SMILES: COc1ccc(cc1OC)C(=O)Nc1ccc2ccccc2c1
InChI Key: InChIKey=SKXUBCZIKHHMHG-UHFFFAOYSA-N
Data: 4 IC50
Activity Spreadsheet -- Enzyme Inhibition Constant Data from BindingDB
Found 4 hits for monomerid = 76669
Trg + Lig
Ki
nM
ΔG°
kcal/mole
IC50
nM
Kd
nM
EC50/IC50
nM
koff
s-1
kon
M-1s-1
pHTemp
°C
Caspase-3
(Homo sapiens (Human))
BDBM76669
(3,4-dimethoxy-N-(2-naphthalenyl)benzamide | 3,4-di...)
Show SMILES COc1ccc(cc1OC)C(=O)Nc1ccc2ccccc2c1
Show InChI InChI=1S/C19H17NO3/c1-22-17-10-8-15(12-18(17)23-2)19(21)20-16-9-7-13-5-3-4-6-14(13)11-16/h3-12H,1-2H3,(H,20,21)
NCI pathway
Reactome pathway
PCBioAssay
n/an/a 2.51E+4n/an/an/an/an/an/a
Burnham Center for Chemical Genomics
Curated by PubChem BioAssay
Assay Description
Data Source: Sanford-Burnham Center for Chemical Genomics (SBCCG) Source Affiliation: Sanford-Burnham Medical Research Institute (SBMRI, San Diego, C...
PubChem Bioassay (2010)
BindingDB Entry DOI: 10.7270/Q2RJ4GZT
Ribosyldihydronicotinamide dehydrogenase [quinone]
(Homo sapiens (Human))
BDBM76669
(3,4-dimethoxy-N-(2-naphthalenyl)benzamide | 3,4-di...)
Show SMILES COc1ccc(cc1OC)C(=O)Nc1ccc2ccccc2c1
Show InChI InChI=1S/C19H17NO3/c1-22-17-10-8-15(12-18(17)23-2)19(21)20-16-9-7-13-5-3-4-6-14(13)11-16/h3-12H,1-2H3,(H,20,21)
n/an/a 5.50E+3n/an/an/an/an/an/a
Purdue University
Curated by ChEMBL
Assay Description
Inhibition of human quinone reductase 2 expressed in Escherichia coli BL21(DE3) using N-methyldihydronicotinamide as co-substrate
Bioorg Med Chem 21: 6022-37 (2013)
Article DOI: 10.1016/j.bmc.2013.07.037
BindingDB Entry DOI: 10.7270/Q21R6RX0
SUMO-1-specific protease
(Homo sapiens (Human))
BDBM76669
(3,4-dimethoxy-N-(2-naphthalenyl)benzamide | 3,4-di...)
Show SMILES COc1ccc(cc1OC)C(=O)Nc1ccc2ccccc2c1
Show InChI InChI=1S/C19H17NO3/c1-22-17-10-8-15(12-18(17)23-2)19(21)20-16-9-7-13-5-3-4-6-14(13)11-16/h3-12H,1-2H3,(H,20,21)
PCBioAssay
n/an/a>1.00E+5n/an/an/an/an/an/a
Burnham Center for Chemical Genomics
Curated by PubChem BioAssay
Assay Description
Data Source: Sanford-Burnham Center for Chemical Genomics (SBCCG) Source Affiliation: Sanford-Burnham Medical Research Institute (SBMRI, San Diego, C...
PubChem Bioassay (2010)
BindingDB Entry DOI: 10.7270/Q27H1H10
SUMO/sentrin specific peptidase family member 8
(Homo sapiens (Human))
BDBM76669
(3,4-dimethoxy-N-(2-naphthalenyl)benzamide | 3,4-di...)
Show SMILES COc1ccc(cc1OC)C(=O)Nc1ccc2ccccc2c1
Show InChI InChI=1S/C19H17NO3/c1-22-17-10-8-15(12-18(17)23-2)19(21)20-16-9-7-13-5-3-4-6-14(13)11-16/h3-12H,1-2H3,(H,20,21)
PCBioAssay
n/an/a>1.00E+5n/an/an/an/an/an/a
Burnham Center for Chemical Genomics
Curated by PubChem BioAssay
Assay Description
Data Source: Sanford-Burnham Center for Chemical Genomics (SBCCG) Source Affiliation: Sanford-Burnham Medical Research Institute (SBMRI, San Diego, C...
PubChem Bioassay (2010)
BindingDB Entry DOI: 10.7270/Q2MS3R7H